{"text_format":"1","workbook":"xlsx","n_sheets":12,"sheets":["Instructions and Assumptions","Project Info","Building Info","Advanced Inputs","HPD Approval Form","Summary and S1 Review","Roof Layout","Results","Assumptions Calcs & Lookups","HPD Underwriting","25 Year Cash Flow","Change Log"],"not_rendered":{"charts":1,"images":3,"macros":1,"external_links":0,"defined_names":160,"comments":7,"pivot_tables":0},"unopened":[],"bounds":{"document_bytes":16777216,"sheet_cells":100000,"rows_first":2000,"rows_last":500,"rows_between":2000,"halvings":0,"cell_chars":16384,"cell_head_chars":4096},"cells_cut":0,"cells_raw":0,"read":"whole","date_system":"1900"}

{"sheet":"Instructions and Assumptions","index":0,"n_rows":306,"n_cols":7,"rows_kept":306,"cut":false,"hidden":false,"merged":[[49,6,49,7],[58,4,58,5],[59,4,59,5],[60,4,60,5],[59,2,59,3],[267,2,276,7],[288,2,294,7],[296,2,299,7],[283,2,283,3],[283,4,283,5],[283,6,283,7],[284,2,284,3],[285,2,285,3],[286,2,286,3],[284,4,284,5],[285,4,285,5],[286,4,286,5],[284,6,284,7],[281,1,282,7],[97,1,100,7],[107,1,109,7],[50,2,50,3],[51,2,51,3],[278,2,278,7],[36,1,39,7],[305,1,309,7],[237,2,241,7],[63,1,64,7],[243,2,256,7],[233,2,235,7],[220,2,224,7],[226,2,230,7],[185,1,188,7],[197,1,199,7],[206,1,207,7],[209,2,213,7],[158,1,162,7],[169,1,174,7],[175,1,175,7],[53,2,53,3],[54,2,54,3],[48,2,48,7],[49,2,49,3],[285,6,285,7],[286,6,286,7],[201,1,201,7],[191,3,191,4],[301,2,301,7],[5,1,5,7],[6,1,11,7],[13,1,13,7],[15,1,15,7],[17,1,17,7],[111,1,111,7],[103,1,103,7],[106,1,106,7],[124,1,124,7],[101,1,101,7],[102,1,102,7],[110,1,110,7],[19,1,19,7],[23,1,23,7],[35,1,35,7],[42,1,44,7],[96,1,96,7],[21,1,21,7],[25,1,25,7],[58,2,58,3],[49,4,49,5],[50,4,50,5],[51,4,51,5],[52,2,52,3],[259,3,259,4],[259,5,259,6],[258,2,258,6],[194,3,194,4],[192,3,192,4],[52,4,52,5],[53,4,53,5],[54,4,54,5],[55,4,55,5],[56,4,56,5],[57,4,57,5],[86,3,86,5],[87,3,87,5],[193,3,193,4],[82,3,82,5],[83,3,83,5],[84,3,84,5],[85,3,85,5],[88,3,88,5],[128,3,128,7],[129,3,129,7],[130,3,130,7],[178,2,183,7],[146,1,156,7],[2,3,2,6],[3,3,3,6],[32,3,32,6],[33,3,33,6],[76,3,76,6],[60,6,60,7],[61,6,61,7],[55,6,55,7],[56,6,56,7],[57,6,57,7],[58,6,58,7],[59,6,59,7],[50,6,50,7],[51,6,51,7],[52,6,52,7],[53,6,53,7],[54,6,54,7],[66,1,69,7],[60,2,60,3],[61,2,61,3],[61,4,61,5],[55,2,55,3],[56,2,56,3],[57,2,57,3],[134,1,135,7],[137,1,139,7],[141,1,144,7],[164,1,166,7],[190,3,190,5],[77,3,77,5],[78,3,78,5],[79,3,79,5],[80,3,80,5],[81,3,81,5],[125,1,125,7],[112,1,117,7],[120,1,123,7],[118,1,118,7],[119,1,119,7],[131,3,131,7],[126,1,126,2],[127,1,127,2],[128,1,128,2],[129,1,129,2],[130,1,130,2],[131,1,131,2],[126,3,126,7],[127,3,127,7]]}
[]
[]
[null,null,null,"SOLAR FEASIBILITY ANALYSIS"]
[null,null,null,"        Version 2.3, Updated December 2023"]
[]
[null,"Instructions"]
[null,"The Solar Feasibility Analysis tool can be used to complete a preliminary assessment of solar financial viability for a New York City affordable housing property. This tool was developed by the New York City Department of Housing Preservation and Development (HPD), with support from non-profit Solar One, as part of the agency's efforts to increase the deployment of solar electric systems on affordable housing properties participating in HPD programs. Completing this Solar Feasibility Analysis is an HPD requirement for all New Construction, Substantial Rehabilitation, and Preservation projects."]
[]
[]
[]
[]
[]
[]
[null,"1. User Inputs: populate all blue fields on the Project Info and Building Info tabs. Please confirm that all fields are populated accurately, as these inputs impact the solar financial model. If you do not understand what value to enter into a required field, hover over the field to view a pop-up with explanatory text and links."]
[]
{"$rows_left_out":292}
{"sheet":"Project Info","index":1,"n_rows":33,"n_cols":3,"rows_kept":33,"cut":false,"hidden":false,"merged":[[30,0,30,6],[5,0,5,6],[4,0,4,6],[26,0,26,1],[6,0,6,6],[7,0,7,1],[7,2,7,6],[16,0,16,1],[16,2,16,6],[18,0,18,1],[18,2,18,6],[17,0,17,1],[17,2,17,6],[8,0,8,1],[8,2,8,6],[13,0,13,6],[15,0,15,1],[29,2,29,6],[29,0,29,1],[15,2,15,6],[11,0,11,1],[11,2,11,6],[23,2,23,6],[24,2,24,6],[12,0,12,1],[12,2,12,6],[27,0,27,1],[26,2,26,6],[27,2,27,6],[20,0,20,1],[21,0,21,1],[22,0,22,1],[23,0,23,1],[24,0,24,1],[33,0,41,6],[32,0,32,6],[9,0,9,1],[9,2,9,6],[14,0,14,1],[14,2,14,6],[20,2,20,6],[21,2,21,6],[22,2,22,6],[25,0,25,6],[10,0,10,1],[10,2,10,6],[28,0,28,1],[28,2,28,6],[31,0,31,6],[19,0,19,6]]}
[null,null,"USER INPUTS"]
[null,null,{"$f":"RIGHT(Results!A2,35)","v":" Version 2.3, Updated December 2023"}]
[]
[]
["PROJECT INFORMATION"]
["Please fill in all information on the following tabs of the Solar Feasibility Analysis: Project Info, Building Info, and Roof Layout. Advanced Inputs are optional. After Applicant sends the completed analysis to Solar One (S1), S1 will provide feedback to applicant or send its recommendation to HPD for approval, and HPD will generate the Solar Approval Form. This tool can be used for single buildings or an aggregated analysis for multi-building portfolios. Please contact affordable@solar1.org for further instructions on using the tool for multiple buildings."]
["Project Details"]
["Project Name (per HPD)"]
["Site Address/es"]
["Construction Type"]
["# of Buildings in Project"]
["Roof Condition"]
["Project includes electrification/energy efficiency"]
["Applicant Information"]
["Submission Date"]
{"$rows_left_out":19}
{"sheet":"Building Info","index":2,"n_rows":41,"n_cols":4,"rows_kept":41,"cut":false,"hidden":false,"merged":[[22,0,22,2],[18,0,18,3],[15,0,15,2],[14,0,14,2],[0,0,0,3],[1,0,1,3],[9,0,9,2],[11,0,11,2],[4,0,5,3],[3,0,3,3],[10,0,10,2],[12,0,12,2],[13,0,13,2],[8,0,8,2],[7,0,7,3],[37,0,38,3],[26,0,26,2],[40,0,42,3],[31,0,31,2],[16,0,16,2],[20,0,20,2],[32,0,32,2],[28,0,28,3],[30,0,30,2],[24,0,24,2],[25,0,25,2],[29,0,29,2],[21,0,21,2],[17,0,17,2],[23,0,23,2],[19,0,19,2]]}
["USER INPUTS"]
[{"$f":"'Instructions and Assumptions'!D4","v":"        Version 2.3, Updated December 2023"}]
[]
["BUILDING INFORMATION"]
["Use this portion of the tool to complete a preliminary assessment of solar financial viability for a New York City affordable housing property. Questions? Please review the Instructions and Assumptions tab, and email affordable@solar1.org if you need help completing this form, have questions about incentives, or for free solar consultation & technical assistance."]
[]
[]
["Project Details"]
["Project Name",null,null,{"$f":"ProjectName","v":0}]
["Site Address/es",null,null,{"$f":"SiteAddress","v":0}]
["Construction Type",null,null,{"$f":"ConstructionType","v":0}]
["Ownership Type"]
["Project Completion Year"]
["Prevailing Wages Required"]
["Number of Dwelling Units in Project"]
{"$rows_left_out":27}
{"sheet":"Advanced Inputs","index":3,"n_rows":42,"n_cols":3,"rows_kept":42,"cut":false,"hidden":true,"merged":[[41,0,43,3],[7,0,7,3],[8,0,8,2],[10,0,10,2],[14,0,14,3],[20,0,20,2],[23,0,23,3],[21,0,21,2],[22,0,22,2],[26,0,26,2],[31,0,31,2],[19,0,19,2],[16,0,16,2],[32,0,32,2],[33,0,33,3],[34,0,37,3],[28,0,28,2],[30,0,30,2],[29,0,29,2],[27,0,27,2],[4,0,4,3],[9,0,9,2],[5,0,6,3],[12,0,12,2],[25,0,25,2],[15,0,15,2],[11,0,11,2],[13,0,13,2],[17,0,17,2],[18,0,18,2],[24,0,24,2]]}
[]
[null,null,"ADVANCED INPUTS"]
[null,null,{"$f":"'Building Info'!A2","v":"        Version 2.3, Updated December 2023"}]
[]
["ADVANCED INPUTS (OPTIONAL)"]
["All fields on this page are optional. Values entered into this form will override any default assumptions or calculated values. Answering these additional inputs will increase the accuracy of your feasibility analysis. Please only populate a cell if you have confirmed information for it. "]
[]
["Projected System Details and Cost"]
["Solar Energy System Size (kW-DC)"]
["Turnkey Solar Energy System Price ($/Watt-DC)"]
["Year One Production (kWh)"]
["Annual Solar Performance Degradation"]
["System Type"]
["Total Price Adjustment % (e.g. GC markup)"]
["Value of Solar ($/kWh)"]
{"$rows_left_out":28}
{"sheet":"HPD Approval Form","index":4,"n_rows":33,"n_cols":6,"rows_kept":33,"cut":false,"hidden":true,"merged":[[19,0,19,1],[19,3,19,4],[20,0,20,2],[20,3,20,5],[32,0,32,1],[28,0,28,2],[29,0,29,2],[25,3,25,4],[31,0,31,5],[30,0,30,5],[26,0,26,5],[27,0,27,5],[28,3,28,5],[29,3,29,5],[25,0,25,1],[24,0,24,1],[24,3,24,4],[21,0,21,1],[21,3,21,4],[23,0,23,1],[22,3,22,4],[23,3,23,4],[22,0,22,1],[8,3,8,5],[9,3,9,5],[17,0,17,1],[18,0,18,1],[18,3,18,4],[15,0,15,2],[14,3,14,5],[14,0,14,2],[15,3,15,5],[16,3,16,4],[17,3,17,4],[10,0,10,5],[16,0,16,1],[32,2,32,3],[0,0,2,5],[12,3,12,5],[13,3,13,5],[12,0,12,2],[13,0,13,2],[4,0,4,5],[5,0,5,2],[6,0,6,2],[7,0,7,2],[11,0,11,5],[8,0,8,2],[9,0,9,2],[5,3,5,5],[6,3,6,5],[7,3,7,5]]}
["HPD SOLAR APPROVAL FORM"]
[]
[]
[]
["Project Details"]
["Project Name",null,null,{"$f":"ProjectName","v":0}]
["Site Address/es",null,null,{"$f":"SiteAddress","v":0}]
["Construction Type",null,null,{"$f":"ConstructionType","v":0}]
["# Buildings in Project",null,null,{"$f":"NumberBuildings","v":0}]
["# Buildings Proposing Solar",null,null,{"$f":"NumberBuildingsSolar","v":0}]
["Projected System Details"]
["Note: When multiple buildings are calculated, the below numbers are project totals and averages. See Site Address/es for details."]
["System Size (kW)",null,null,{"$f":"IFERROR(ROUND(PVSystemSize,2)&\" kW-DC\",0)","v":"0 kW-DC"}]
["System Design Type",null,null,{"$f":"'Summary and S1 Review'!D17","v":"Ballasted"}]
["Est. Y1 Production (kWh)",null,null,{"$f":"IFERROR(Y1SolarProduction,0)","v":0}]
{"$rows_left_out":19}
{"sheet":"Summary and S1 Review","index":5,"n_rows":35,"n_cols":7,"rows_kept":35,"cut":false,"hidden":true,"merged":[[23,4,23,6],[1,1,1,6],[28,5,28,6],[0,1,0,6],[19,4,19,5],[15,4,15,5],[16,4,16,5],[17,4,17,5],[18,4,18,5],[13,1,13,3],[6,1,6,2],[7,1,7,2],[9,1,9,2],[10,1,10,2],[8,1,8,2],[13,4,13,6],[8,3,8,6],[9,4,9,5],[10,4,10,5],[5,1,5,6],[7,3,7,6],[6,3,6,6],[11,1,11,2],[11,4,11,5],[34,1,34,2],[30,1,30,2],[31,1,31,2],[24,1,24,3],[24,4,24,6],[28,2,28,3],[25,5,25,6],[26,5,26,6],[27,5,27,6],[23,1,23,2],[16,1,16,2],[25,2,25,3],[26,2,26,3],[27,2,27,3],[14,1,14,6],[33,1,33,6],[31,3,31,6],[30,3,30,6],[34,3,34,4],[29,1,29,6],[20,4,20,5],[21,4,21,5],[22,4,22,5],[15,1,15,2],[20,1,20,2],[21,1,21,2],[22,1,22,2],[17,1,17,2],[19,1,19,2],[18,1,18,3]]}
[null,{"$f":"D7&\" Solar Summary\"","v":"0 Solar Summary"}]
[null,{"$f":"RIGHT(Results!A2,35)","v":" Version 2.3, Updated December 2023"}]
[null,null,null,null,null," "]
[]
[]
[null,"Project Details"]
[null,"Project Name",null,{"$f":"ProjectName","v":0}]
[null,"Site Address/es",null,{"$f":"SiteAddress","v":0}]
[null,"Est. Annual Owner-Paid Electricity Costs",null,{"$f":"AnnualElectricBill","v":0}]
[null,"# Buildings in Project",null,{"$f":"NumberBuildings","v":0},"Total Number of Dwelling Units",null,{"$f":"DwellingUnits","v":0}]
[null,"# Buildings Proposing Solar",null,{"$f":"NumberBuildingsSolar","v":0},"Eligible for Federal Solar Tax Credit",null,{"$f":"TaxIncentiveEligible","v":0}]
[null,"Construction Type",null,{"$f":"ConstructionType","v":0},"LIHTC Project",null,{"$f":"LIHTCEligible","v":0}]
[null,"Is Project EGC or LEED?",null,{"$f":"EGCorLEED","v":0},"Includes Solar in LIHTC Eligible Basis",null,{"$f":"IF(IncludeLIHTC=0, \"N/A\", IncludeLIHTC)","v":"N/A"}]
[null,"Projected System Details",null,null,"Solar Costs and Incentives"]
[null,"Note: When multiple buildings are calculated, the below numbers are project totals or averages."]
{"$rows_left_out":21}
{"sheet":"Roof Layout","index":6,"n_rows":37,"n_cols":6,"rows_kept":37,"cut":false,"hidden":false,"merged":[[36,0,36,6],[37,0,42,6],[1,0,1,6],[2,0,2,6],[4,0,4,6],[5,0,6,6],[35,0,35,6],[9,0,9,3]]}
[]
["ROOF LAYOUT"]
[{"$f":"'Building Info'!A2","v":"        Version 2.3, Updated December 2023"}]
[]
["SOLAR PV SYSTEM LAYOUT OR USABLE ROOF AREA"]
["Provide image/s of roof plan(s) with solar layout or usable roof area. Please include any existing or planned equipment (e.g. HVAC systems, electrification equipment, cell towers, antennas, roof decks, etc.).Identify key features on image or in comments section below.  Images should include any of the following to clarify design features or obstacles:"]
[]
[null,"> Sketch",null,null,"> Building Plans","> Drawings"]
[null,"> Screenshot",null,null,"> Rendering","> Diagrams"]
["Roof Condition:",null,null,null,{"$f":"IF(RoofCondition=0, \"Not Populated\", RoofCondition)","v":"Not Populated"}]
[]
[]
[]
[]
[]
{"$rows_left_out":23}
{"sheet":"Results","index":7,"n_rows":42,"n_cols":6,"rows_kept":42,"cut":false,"hidden":false,"merged":[[41,0,41,5],[1,0,1,5],[0,0,0,5],[30,3,30,5],[31,3,36,5],[4,0,7,5],[3,0,3,5],[30,0,30,1],[8,0,8,1],[8,3,8,5],[15,0,15,1],[25,0,25,1],[35,0,36,1]]}
["SOLAR FEASIBILITY ANALYSIS RESULTS"]
[{"$f":"\"           \"&'Roof Layout'!A3","v":"                   Version 2.3, Updated December 2023"}]
[]
[{"$f":"\"PRELIMINARY SOLAR FINANCIAL ANALYSIS: \"&ProjectName","v":"PRELIMINARY SOLAR FINANCIAL ANALYSIS: "}]
["Solar electric systems provide electricity bill savings, however they are also eligible for a number of federal, state and local incentives that can significantly improve return on investment. The summary below includes estimated costs, incentives, electricity bill savings, and payback period for a solar energy system on this property. The payback period captures incentives listed, but do not necessarily impact HPD's budget or underwriting. "]
[]
[]
[]
["PROJECTED SYSTEM PERFORMANCE",null,null,"ESTIMATED COSTS"]
["Solar Energy System Size (kW-DC)",{"$f":"IFERROR(IF(RecommendedPVSystemSize<4,\"System Too Small\",RecommendedPVSystemSize),0)","v":0},null,"Pre-Incentive Cost Estimate ",null,{"$f":"ABS(IFERROR('Assumptions Calcs & Lookups'!$B$113,0))","v":0}]
["Est. Year One Solar Production (kWh)",{"$f":"IFERROR(Y1SolarProduction,0)","v":0},null,"NY-SUN Incentive","-",{"$f":"ABS(IFERROR(NYSunIncentive,0))","v":0}]
["Year One Utility Bill Savings",{"$f":"IFERROR('25 Year Cash Flow'!F5,0)","v":0},null,"Upfront Cost Estimate"," =",{"$f":"ABS(IFERROR(F10-F11,\"\"))","v":0}]
["NY-SUN $/Watt",{"$f":"IFERROR(NYSUNDollarPerWattDC,0)","v":0}]
["Total Cost ($/Watt-DC)",{"$f":"IFERROR(F10/(PVSystemSize*1000),0)","v":0}]
[]
{"$rows_left_out":28}
{"sheet":"Assumptions Calcs & Lookups","index":8,"n_rows":196,"n_cols":15,"rows_kept":196,"cut":false,"hidden":true,"merged":[[1,7,1,9],[2,0,2,2],[16,0,16,1],[18,0,18,1],[14,8,14,10],[15,8,15,10],[16,8,16,10],[17,8,17,10],[13,8,13,10],[2,7,2,14],[18,8,18,10],[19,8,19,10],[20,8,20,10],[31,0,31,1],[110,0,110,1],[52,0,52,1],[60,0,60,1],[34,0,34,1],[73,0,73,1],[86,0,86,1],[92,0,92,2],[104,0,104,1],[45,0,45,1],[32,0,32,1]]}
["Assumptions, Calculations and Lookup Tables"]
[null,null,null,null,null,null,null,"Project Completion Year:",null,null,{"$f":"IF(ProjectCompletionYearIN=\"\",'Assumptions Calcs & Lookups'!H5,ProjectCompletionYearIN)","v":2024}]
["System Price Estimate ($/Watt-DC)",null,null,"<- Update every 12 months",null,null,null,"Incentives"]
["Min (kW-DC)","Max (kW-DC)","Price ($/Watt-DC)",null,null,null,null,"Year","ITC","RETC","NY-SUN >1 MW","NY-SUN >200kW","NY-SUN <200kW","NY-SUN Affordable Adder","NY-SUN Affordable CDG"]
[4,9.99,5.5,null,null,null,null,2024,0.3,0.3,0.5,1,1,0.6,0.4]
[10,19.989999999999998,4.6750000000000007,null,null,null,null,2025,0.3,0.3]
[20,29.99,3.9600000000000004,null,null,null,null,2026,0.3,0.3]
[30,44.99,3.63,null,null,null,null,2027,0.3,0.3]
[45,64.989999999999995,3.4100000000000006,null,null,null,null,2028,0.3,0.3]
[65,79.989999999999995,3.2450000000000006,null,null,null,null,2029,0.3,0.3]
[80,99.99,3.1350000000000002,null,null,null,null,2030,0.3,0.3]
[100,149.99,2.9700000000000006]
[150,249.99,2.75,null,null,null,null,"EPC Price Decrease by Project Completion Year"]
[250,499.99,2.5299999999999998,null,null,null,null,"Year","Base Price Percentage"]
[500,749.99,2.4200000000000004,null,null,null,null,2024,1]
{"$rows_left_out":182}
{"sheet":"HPD Underwriting","index":9,"n_rows":46,"n_cols":5,"rows_kept":46,"cut":false,"hidden":true,"merged":[[11,0,11,2],[4,0,4,3],[5,0,6,3],[7,0,7,3],[8,0,8,2],[10,0,10,2],[9,0,9,2],[22,0,22,2],[12,0,12,2],[13,0,13,2],[14,0,14,2],[16,0,16,3],[17,0,17,2],[18,0,18,2],[19,0,19,2],[20,0,20,2],[21,0,21,2],[36,0,36,2],[23,0,23,2],[25,0,25,3],[26,0,26,2],[27,0,27,2],[28,0,28,2],[29,0,29,2],[30,0,30,2],[31,0,31,2],[32,0,32,2],[33,0,33,2],[35,0,35,3],[43,0,43,2],[44,0,44,2],[45,0,45,2],[37,0,37,2],[38,0,38,2],[39,0,39,2],[40,0,40,2],[41,0,41,2],[42,0,42,2]]}
[]
[null,null,"   Solar Underwriting Tool"]
[null,null,{"$f":"RIGHT(Results!A2,48)","v":"              Version 2.3, Updated December 2023"}]
[]
["User Inputs"]
["User to fill in all Highlighted Cells (blue). All other cells will be automatically populated/calculated. This tool can be used to assess preliminary solar financial viability for an NYC affordable housing property from an HPD underwriting perspective."]
[]
["Inputs from Solar Screening Tool or Solar Designer"]
["Site Address",null,null,{"$f":"SiteAddress","v":0}]
["Number of Dwelling Units",null,null,{"$f":"DwellingUnits","v":0}]
["Solar Systen Size (kW-DC) ",null,null,{"$f":"PVSystemSize","v":0}]
["Estimated Owner Electric Cost (Annual)",null,null,{"$f":"AnnualElectricBill","v":0}]
["Year One Utility Bill Savings (should be lower than Owner's Electric Cost)",null,null,{"$f":"Results!B12","v":0}]
["Upfront Cost Estimate (after NY-SUN) ",null,null,{"$f":"Results!F12","v":0}]
["Estimated Payback (in years)",null,null,{"$f":"Results!B28","v":"0 years"}]
{"$rows_left_out":32}
{"sheet":"25 Year Cash Flow","index":10,"n_rows":29,"n_cols":19,"rows_kept":29,"cut":false,"hidden":true,"merged":[]}
["25 Year Cashflow"]
[]
["Year","Solar Energy Production (kWh)","Value of Solar ($/kWh)","Customer Benefit Contribution (Behind-the-Meter)","New Meter Fees (CDG Only)","Net Electricity Bill Savings","Upfront System Cost","Inverter Replacement","Federal Tax Credit","LIHTC","Property Tax Abatement","NYS Tax Credit","NYS Historic Tax Credit","Federal Accelerated Depreciation","State Depreciation","Increased Federal Taxes Due to State Tax Credits","Balance","Balance (No Tax Incentives)","Cash Inflows and Outflows"]
[0,null,null,null,null,null,{"$f":"UpfrontCost","v":{"$error":"#N/A"}},null,null,null,null,null,null,null,null,null,{"$f":"SUM(F4:P4)","v":{"$error":"#N/A"}},{"$f":"Q4","v":{"$error":"#N/A"}},{"$f":"SUM(F4:P4)","v":{"$error":"#N/A"}}]
[1,{"$f":"Y1SolarProduction","v":{"$error":"#N/A"}},{"$f":"Y1VoS","v":{"$error":"#N/A"}},{"$f":"NEMAnnualCBC","v":0},{"$f":"CDGAnnualMeterFee","v":0},{"$f":"(B5*C5)+SUM(D5:E5)","v":{"$error":"#N/A"}},null,null,{"$f":"ITC","v":{"$error":"#N/A"}},{"$f":"TenYearLIHTCValue/10","v":{"$error":"#N/A"}},{"$f":"NYCPTA/4","v":0},{"$f":"NYSResidentialTaxCredit","v":{"$error":"#N/A"}},{"$f":"NYSHistoricTaxCredit","v":0},{"$f":"'Assumptions Calcs & Lookups'!B102*'Assumptions Calcs & Lookups'!B95*'Assumptions Calcs & Lookups'!$B$89","v":0},{"$f":"'Assumptions Calcs & Lookups'!$B$103*'Assumptions Calcs & Lookups'!C95*'Assumptions Calcs & Lookups'!$B$90","v":0},{"$f":"IncreasedFedTaxesDue_to_State_Incentives","v":0},{"$f":"Q4+SUM(F5:P5)","v":{"$error":"#N/A"}},{"$f":"R4+F5+H5","v":{"$error":"#N/A"}},{"$error":"#N/A"}]
[2,{"$f":"B5*(1-AnnualPVDegradation)","v":{"$error":"#N/A"}},{"$f":"C5*(1+VoSEscalator)","v":{"$error":"#N/A"}},0,{"$f":"CDGAnnualMeterFee","v":0},{"$f":"(B6*C6)+SUM(D6:E6)","v":{"$error":"#N/A"}},null,null,null,{"$f":"TenYearLIHTCValue/10","v":{"$error":"#N/A"}},{"$f":"NYCPTA/4","v":0},null,null,{"$f":"'Assumptions Calcs & Lookups'!$B$102*'Assumptions Calcs & Lookups'!B96*'Assumptions Calcs & Lookups'!$B$89","v":0},{"$f":"'Assumptions Calcs & Lookups'!$B$103*'Assumptions Calcs & Lookups'!C96*'Assumptions Calcs & Lookups'!$B$90","v":0},null,{"$error":"#N/A"},{"$error":"#N/A"},{"$error":"#N/A"}]
[3,{"$error":"#N/A"},{"$error":"#N/A"},0,0,{"$error":"#N/A"},null,null,null,{"$error":"#N/A"},{"$f":"NYCPTA/4","v":0},null,null,{"$f":"'Assumptions Calcs & Lookups'!$B$102*'Assumptions Calcs & Lookups'!B97*'Assumptions Calcs & Lookups'!$B$89","v":0},{"$f":"'Assumptions Calcs & Lookups'!$B$103*'Assumptions Calcs & Lookups'!C97*'Assumptions Calcs & Lookups'!$B$90","v":0},null,{"$error":"#N/A"},{"$error":"#N/A"},{"$error":"#N/A"}]
[4,{"$error":"#N/A"},{"$error":"#N/A"},0,0,{"$error":"#N/A"},null,null,null,{"$error":"#N/A"},{"$f":"NYCPTA/4","v":0},null,null,{"$f":"'Assumptions Calcs & Lookups'!$B$102*'Assumptions Calcs & Lookups'!B98*'Assumptions Calcs & Lookups'!$B$89","v":0},{"$f":"'Assumptions Calcs & Lookups'!$B$103*'Assumptions Calcs & Lookups'!C98*'Assumptions Calcs & Lookups'!$B$90","v":0},null,{"$error":"#N/A"},{"$error":"#N/A"},{"$error":"#N/A"}]
[5,{"$error":"#N/A"},{"$error":"#N/A"},0,0,{"$error":"#N/A"},null,null,null,{"$error":"#N/A"},null,null,null,{"$f":"'Assumptions Calcs & Lookups'!$B$102*'Assumptions Calcs & Lookups'!B99*'Assumptions Calcs & Lookups'!$B$89","v":0},{"$f":"'Assumptions Calcs & Lookups'!$B$103*'Assumptions Calcs & Lookups'!C99*'Assumptions Calcs & Lookups'!$B$90","v":0},null,{"$error":"#N/A"},{"$error":"#N/A"},{"$error":"#N/A"}]
[6,{"$error":"#N/A"},{"$error":"#N/A"},0,0,{"$error":"#N/A"},null,null,null,{"$error":"#N/A"},null,null,null,{"$f":"'Assumptions Calcs & Lookups'!$B$102*'Assumptions Calcs & Lookups'!B100*'Assumptions Calcs & Lookups'!$B$89","v":0},{"$f":"'Assumptions Calcs & Lookups'!$B$103*'Assumptions Calcs & Lookups'!C100*'Assumptions Calcs & Lookups'!$B$90","v":0},null,{"$error":"#N/A"},{"$error":"#N/A"},{"$error":"#N/A"}]
[7,{"$error":"#N/A"},{"$error":"#N/A"},0,0,{"$error":"#N/A"},null,null,null,{"$error":"#N/A"},null,null,null,null,null,null,{"$error":"#N/A"},{"$error":"#N/A"},{"$error":"#N/A"}]
[8,{"$error":"#N/A"},{"$error":"#N/A"},0,0,{"$error":"#N/A"},null,null,null,{"$error":"#N/A"},null,null,null,null,null,null,{"$error":"#N/A"},{"$error":"#N/A"},{"$error":"#N/A"}]
[9,{"$error":"#N/A"},{"$error":"#N/A"},0,0,{"$error":"#N/A"},null,null,null,{"$error":"#N/A"},null,null,null,null,null,null,{"$error":"#N/A"},{"$error":"#N/A"},{"$error":"#N/A"}]
[10,{"$error":"#N/A"},{"$error":"#N/A"},0,0,{"$error":"#N/A"},null,null,null,{"$error":"#N/A"},null,null,null,null,null,null,{"$error":"#N/A"},{"$error":"#N/A"},{"$error":"#N/A"}]
[11,{"$error":"#N/A"},{"$error":"#N/A"},0,0,{"$error":"#N/A"},null,null,null,null,null,null,null,null,null,null,{"$error":"#N/A"},{"$error":"#N/A"},{"$error":"#N/A"}]
{"$rows_left_out":15}
{"sheet":"Change Log","index":11,"n_rows":223,"n_cols":3,"rows_kept":223,"cut":false,"hidden":true,"merged":[[218,0,218,1],[212,0,212,1]]}
["CHANGE LOG"]
["Last updated by Alex Federico on 12/15/2023"]
["2023-12-14"]
["Item","Description"]
["Assumptions Calcs & Lookups","B50 - updated electricity rate used to calculate annual kWh usage to draw from NEM EL1 rate"]
["Assumptions Calcs & Lookups","Added \"<- Assuming that NY-SUN incentive and NY State income tax credits result in corresponding increase to federal income, and therefore tax liability. https://www.bu.edu/law/files/2016/06/Feld-Final-5-30.pdf.\""]
["Assumptions Calcs & Lookups","changed\"<- Applied when owner-paid electricity is metered under EL8, EL9, or EL12 rate in order to increase value of solar under VDER tariff.\" to \"<- Applied when system is interconnected as CDG (Community Distributed Generation)\""]
["Instructions & Assumptions","removed 2023 numbers from Depreciation instructions."]
["Assumptions Calcs & Lookups","changed CSRP note to say: \"<-Default is most common peak time (4:00-8:00 PM). Advanced Inputs allow for override.\""]
["Assumptions Calcs & Lookups","Removed the note \"<- Assuming net energy metering for EL2, EL1, EL9 with >25 kW peak demand, and PSEG-LI. VDER for all other electricity tariffs.\" from Assumptions & Calculations C67"]
["Assumptions Calcs & Lookups","Changed Version to \"Version 2.3, Updated December 2023\""]
["Instructions & Assumptions: Federal Tax Credit","Added the following language\n\"…The tax credit is currently available for commercial businesses (as the Investment Tax Credit or ITC), for tax-exempt organizations (through Elective/Direct pay), or for owner-occupied homes, including co-ops and condos (as the Residential Energy Tax Credit or RETC - option to be taken through Transferability)...\""]
["Instructions & Assumptions","Removed the NY-SUN Incentives from the Solar Incentives section and moved it to a new section titled \"NY-SUN Incentives\" right after the Solar Incentives.  This includes the Incentive rates, NY_SUN Multifamily Affordable Incentive and the NY-SUN Affordable CDG Incentive."]
["Instructions & Assumptions: NYS Residential Tax Credit","Added the following language:\n\"...educting the NY-SUN incentive. This tax credit goes directly to residents and is non-refundable, so owner-residents must have a tax liability to take this incentive. The NYS…\""]
["Instructions & Assumptions: NYC Solar Property Tax Abatement","Updated the rate from 20% to 30%\nAdded the following language: \n\"...incentive cannot be monetized. If a building has a partial exemption, this incentive may be monetized on the remaining taxes. A user can\"\n\"...Building Info tab and elaborate on eligibility in the Comments section.”"]
{"$rows_left_out":208}