{"text_format":"1","workbook":"xlsx","n_sheets":14,"sheets":["Instructions and Assumptions","Project Info","Building Info","Multiple Buildings","Summary and S1 Review","Advanced Inputs","HPD Approval Form","Roof Layout","Results","Data Validation","Assumptions Calcs & Lookups","HPD Underwriting","25 Year Cash Flow","Change Log"],"not_rendered":{"charts":1,"images":3,"macros":1,"external_links":0,"defined_names":205,"comments":6,"pivot_tables":0},"unopened":[],"bounds":{"document_bytes":16777216,"sheet_cells":100000,"rows_first":2000,"rows_last":500,"rows_between":2000,"halvings":0,"cell_chars":16384,"cell_head_chars":4096},"cells_cut":0,"cells_raw":0,"read":"whole","date_system":"1900"}

{"sheet":"Instructions and Assumptions","index":0,"n_rows":271,"n_cols":6,"rows_kept":271,"cut":false,"hidden":false,"merged":[[12,0,12,6],[189,0,189,6],[179,2,179,3],[47,1,47,2],[182,2,182,3],[180,2,180,3],[47,3,47,4],[48,3,48,4],[67,2,67,4],[68,2,68,4],[114,0,114,6],[51,3,51,4],[52,3,52,4],[49,5,49,6],[64,2,64,4],[95,0,95,6],[53,1,53,2],[53,3,53,4],[54,3,54,4],[55,3,55,4],[54,1,54,2],[55,1,55,2],[56,1,56,2],[56,3,56,4],[249,3,249,4],[250,3,250,4],[248,5,248,6],[249,5,249,6],[250,5,250,6],[245,0,246,6],[86,0,89,6],[96,0,98,6],[234,1,243,6],[99,0,99,6],[116,0,116,1],[117,0,117,1],[118,0,118,1],[221,1,221,6],[115,2,115,6],[116,2,116,6],[115,0,115,1],[153,0,153,3],[154,0,154,6],[190,0,190,6],[101,0,106,6],[109,0,112,6],[100,0,100,6],[92,0,92,6],[270,0,274,6],[229,1,233,6],[58,0,59,6],[224,1,226,6],[209,1,213,6],[216,1,220,6],[173,0,176,6],[185,0,187,6],[194,0,195,6],[197,1,201,6],[147,0,151,6],[157,0,162,6],[163,0,163,6],[253,1,258,6],[261,1,264,6],[247,1,247,2],[247,3,247,4],[247,5,247,6],[248,1,248,2],[249,1,249,2],[250,1,250,2],[113,0,113,6],[90,0,90,6],[91,0,91,6],[43,1,43,6],[19,0,19,6],[23,0,23,6],[30,0,30,6],[37,0,39,6],[31,0,34,6],[48,1,48,2],[49,1,49,2],[21,0,21,6],[44,3,44,4],[45,1,45,2],[44,5,44,6],[44,1,44,2],[45,3,45,4],[46,3,46,4],[2,2,2,5],[3,2,3,5],[27,2,27,5],[28,2,28,5],[63,2,63,5],[55,5,55,6],[56,5,56,6],[50,5,50,6],[51,5,51,6],[52,5,52,6],[53,5,53,6],[54,5,54,6],[45,5,45,6],[46,5,46,6],[47,5,47,6],[48,5,48,6],[46,1,46,2],[5,0,5,6],[6,0,11,6],[13,0,13,6],[15,0,15,6],[17,0,17,6],[49,3,49,4],[50,3,50,4],[50,1,50,2],[51,1,51,2],[52,1,52,2],[107,0,107,6],[108,0,108,6],[73,2,73,4],[74,2,74,4],[69,2,69,4],[70,2,70,4],[71,2,71,4],[72,2,72,4],[75,2,75,4],[85,0,85,6],[66,2,66,4],[65,2,65,4],[83,0,83,6],[252,1,252,6],[260,1,260,6],[269,0,269,6],[228,1,228,6],[223,1,223,6],[208,1,208,6],[181,2,181,3],[117,2,117,6],[118,2,118,6],[119,2,119,6],[166,1,171,6],[135,0,145,6],[123,0,124,6],[126,0,128,6],[130,0,133,6],[178,2,178,4],[120,2,120,6],[266,1,266,6],[119,0,119,1],[120,0,120,1],[202,1,202,6],[204,1,204,6],[206,1,206,6],[248,3,248,4]]}
[]
[]
[null,null,"SOLAR FEASIBILITY ANALYSIS"]
[null,null,"        Version 2025 1.1, Updated May 2025"]
[]
["Instructions"]
["The Solar Feasibility Analysis tool can be used to complete a preliminary assessment of solar financial viability for New York City affordable housing properties. This tool was developed by the New York City Department of Housing Preservation and Development (HPD), with support from non-profit Solar One, as part of the agency's efforts to increase the deployment of solar energy systems on affordable housing properties participating in HPD programs. Completing this Solar Feasibility Analysis is an HPD requirement for Substantial Rehabilitation & Preservation projects, and optional for New Construction projects. Solar One can provide free and comprehensive solar technical assistance to all HPD projects. Contact affordable@solar1.org with any inquiries."]
[]
{"$rows_left_out":264}
{"sheet":"Project Info","index":1,"n_rows":32,"n_cols":1,"rows_kept":32,"cut":false,"hidden":false,"merged":[[31,0,31,1],[32,0,40,1],[0,0,0,1],[1,0,1,1],[2,0,2,1],[30,0,30,1],[27,0,27,1],[22,0,22,1],[15,0,15,1],[6,0,6,1],[4,0,4,1],[5,0,5,1]]}
["USER INPUTS"]
[{"$f":"'Instructions and Assumptions'!C4","v":"        Version 2025 1.1, Updated May 2025"}]
[]
[]
["PROJECT INFORMATION"]
["Please fill in the following tabs: Project Info, Building Info, and Roof Layout. For portfolio projects, skip Building Info and proceed to the \"Multiple Buildings\" tab. Optionally, enter only verified information in the Advanced Inputs tab. S1 will provide feedback on all submissions.\nFor Sub Rehab/Preservation projects, S1 will send a  recommendation to HPD, and HPD will generate the signed Solar Approval Form. If you are part of an HPD Development project, do not submit an analysis until after the pre-scoping meeting. \nFor portfolio submissions, press the orange button below to fill in the Multiple Buildings tab. Please note that for portfolio projects, you do not need to fill out the \"Building Info\" tab, and  the Results tab will not be populated until S1 completes a portfolio analysis.\n*Effective 11/15/24, the DOB no longer accepts HPD exemption letters for financial infeasibility. Projects with new roofs/new roof assemblies subject to LL92/94 will need to comply with the DOB requirement. Contact affordable@solar1.org for further instructions or questions."]
["Project Details"]
["Project Name (per HPD)"]
{"$rows_left_out":25}
{"sheet":"Building Info","index":2,"n_rows":37,"n_cols":2,"rows_kept":37,"cut":false,"hidden":false,"merged":[[35,0,35,1],[36,0,36,1],[18,0,18,1],[5,0,5,1],[0,0,0,1],[1,0,1,1],[3,0,3,1],[26,0,26,1],[4,0,4,1]]}
["USER INPUTS"]
[{"$f":"'Instructions and Assumptions'!C4","v":"        Version 2025 1.1, Updated May 2025"}]
[]
["BUILDING INFORMATION"]
["Use this tool to complete a preliminary assessment of solar financial viability for a New York City affordable housing property. If you have questions, review the Instructions and Assumptions tab or email affordable@solar1.org for assistance or a free solar consultation.\n\nNote: For portfolio projects, skip this tab and proceed to the \"Multiple Buildings\" tab."]
["Project Details"]
["Project Name (per HPD)",{"$f":"ProjectName","v":0}]
["Site Address/es",{"$f":"SiteAddress","v":0}]
{"$rows_left_out":30}
{"sheet":"Multiple Buildings","index":3,"n_rows":15,"n_cols":12,"rows_kept":15,"cut":false,"hidden":true,"merged":[[73,0,73,1],[74,0,74,1],[67,0,67,1],[68,0,68,1],[69,0,69,1],[70,0,70,1],[71,0,71,1],[72,0,72,1],[66,0,66,1],[55,0,55,1],[56,0,56,1],[57,0,57,1],[58,0,58,1],[59,0,59,1],[60,0,60,1],[61,0,61,1],[62,0,62,1],[63,0,63,1],[64,0,64,1],[65,0,65,1],[54,0,54,1],[43,0,43,1],[44,0,44,1],[45,0,45,1],[46,0,46,1],[47,0,47,1],[48,0,48,1],[49,0,49,1],[50,0,50,1],[51,0,51,1],[52,0,52,1],[53,0,53,1],[42,0,42,1],[31,0,31,1],[32,0,32,1],[33,0,33,1],[34,0,34,1],[35,0,35,1],[36,0,36,1],[37,0,37,1],[38,0,38,1],[39,0,39,1],[40,0,40,1],[41,0,41,1],[30,0,30,1],[19,0,19,1],[20,0,20,1],[21,0,21,1],[22,0,22,1],[23,0,23,1],[24,0,24,1],[25,0,25,1],[26,0,26,1],[27,0,27,1],[28,0,28,1],[29,0,29,1],[8,0,8,1],[8,2,8,3],[18,0,18,1],[9,0,9,1],[9,2,9,3],[10,0,10,1],[10,2,10,3],[11,0,11,1],[11,2,11,3],[13,0,13,11],[14,0,14,1],[15,0,15,1],[16,0,16,1],[17,0,17,1],[5,0,5,1],[5,2,5,3],[6,0,6,1],[6,2,6,3],[7,0,7,1],[7,2,7,3],[0,1,0,9],[1,1,1,9],[3,0,3,3],[4,0,4,1],[4,2,4,3]]}
[null,"USER INPUTS FOR MULTIPLE BUILDINGS"]
[null,{"$f":"'Instructions and Assumptions'!C4","v":"        Version 2025 1.1, Updated May 2025"}]
[]
["PROJECT INFORMATION"]
["Ownership Type"]
["Estimated Project Completion Year"]
["Prevailing Wages Required"]
["Is project eligible for the Federal Solar Tax Credit?"]
{"$rows_left_out":8}
{"sheet":"Summary and S1 Review","index":4,"n_rows":37,"n_cols":10,"rows_kept":37,"cut":false,"hidden":true,"merged":[[36,2,36,8],[35,9,35,10],[34,2,34,8],[30,9,30,10],[31,9,31,10],[32,9,32,10],[34,9,34,10],[25,9,25,10],[26,9,26,10],[27,9,27,10],[28,9,28,10],[29,9,29,10],[35,2,35,3],[32,2,32,3],[33,2,33,8],[35,4,35,5],[30,5,30,8],[29,2,29,3],[27,2,27,3],[28,2,28,3],[30,2,30,3],[27,6,27,8],[28,6,28,8],[29,6,29,8],[5,9,5,10],[6,9,6,10],[7,9,7,10],[8,9,8,10],[9,9,9,10],[10,9,10,10],[24,9,24,10],[17,9,17,10],[18,9,18,10],[19,9,19,10],[15,9,15,10],[23,9,23,10],[20,9,20,10],[21,9,21,10],[22,9,22,10],[16,9,16,10],[13,9,13,10],[0,9,0,10],[1,9,1,10],[2,9,2,10],[3,9,3,10],[4,9,4,10],[35,0,35,1],[27,0,27,1],[28,0,28,1],[29,0,29,1],[30,0,30,1],[31,0,31,1],[22,0,22,1],[23,0,23,1],[24,0,24,1],[26,0,26,1],[19,0,19,1],[18,0,18,1],[20,0,20,1],[12,0,12,1],[13,0,13,1],[14,0,14,1],[11,9,11,10],[12,9,12,10],[14,9,14,10],[0,2,0,8],[1,2,1,8],[35,7,35,8],[0,0,0,1],[1,0,1,1],[2,0,2,1],[3,0,3,1],[4,0,4,1],[5,0,5,1],[6,0,6,1],[7,0,7,1],[8,0,8,1],[9,0,9,1],[10,0,10,1],[11,0,11,1],[31,2,31,8],[32,4,32,8],[11,5,11,8],[12,2,12,8],[11,2,11,4],[14,2,14,3],[13,5,13,6],[8,5,8,8],[15,0,15,1],[16,0,16,1],[20,2,20,3],[17,2,17,4],[16,5,16,8],[25,5,25,8],[26,6,26,8],[22,2,22,3],[23,2,23,3],[24,2,24,3],[21,2,21,3],[18,5,18,6],[23,5,23,6],[26,2,26,3],[18,2,18,3],[19,2,19,3],[24,5,24,8],[22,5,22,6],[25,2,25,4],[19,5,19,6],[20,5,20,6],[21,5,21,6],[3,2,3,8],[6,2,6,3],[4,4,4,8],[5,4,5,8],[14,5,14,6],[15,5,15,6],[17,5,17,6],[4,2,4,3],[5,2,5,3],[9,2,9,3],[10,2,10,3],[7,2,7,3],[9,5,9,6],[8,2,8,3],[16,2,16,3],[7,7,7,8],[9,7,9,8],[10,7,10,8],[13,2,13,3],[6,5,6,6],[6,7,6,8],[15,2,15,3],[7,5,7,6],[10,5,10,6]]}
[null,null,{"$f":"E5&\" Solar Summary\"","v":" Solar Summary"}]
[null,null,{"$f":"RIGHT(Results!A2,35)","v":" Version 2025 1.1, Updated May 2025"}]
[null,null,null,null,null,null," "]
[null,null,"Project Details"]
[null,null,"Project Name",null,{"$f":"IF(ProjectName=\"\",\"\",ProjectName)","v":""}]
[null,null,"Site Address/es",null,{"$f":"IF(SiteAddress=\"\",\"\",SiteAddress)","v":""}]
[null,null,"Project Design Phase",null,{"$f":"ProjectStatus","v":0},"Submission Date",null,{"$f":"IF(Date=0,\"0\",Date)","v":"0"}]
[null,null,"Construction Type",null,{"$f":"IF(ConstructionType=\"\",\"\",ConstructionType)","v":""},"Eligible for Federal Solar Tax Credit",null,{"$f":"IF(TaxIncentiveEligible=\"\",\"\",TaxIncentiveEligible)","v":""}]
{"$rows_left_out":30}
{"sheet":"Advanced Inputs","index":5,"n_rows":43,"n_cols":1,"rows_kept":43,"cut":false,"hidden":true,"merged":[[37,0,37,1],[42,0,42,1],[38,0,38,1],[0,0,0,1],[1,0,1,1],[4,0,4,1],[22,0,22,1],[13,0,13,1],[5,0,5,1],[3,0,3,1]]}
["USER INPUTS"]
[{"$f":"'Instructions and Assumptions'!C4","v":"        Version 2025 1.1, Updated May 2025"}]
[]
["ADVANCED INPUTS (OPTIONAL)"]
["All fields on this page are optional. Values entered into this form will override any default assumptions or calculated values. Answering these additional inputs will increase the accuracy of your feasibility analysis. Please only populate a cell if you have confirmed information for it. "]
["Projected System Details and Cost"]
["Solar Energy System Size (kW-DC)"]
["Total Solar Energy System Price ($/Watt-DC)"]
{"$rows_left_out":36}
{"sheet":"HPD Approval Form","index":6,"n_rows":37,"n_cols":7,"rows_kept":37,"cut":false,"hidden":true,"merged":[[21,0,21,1],[23,3,23,4],[22,3,22,4],[18,3,18,4],[19,3,19,4],[20,3,20,4],[21,3,21,4],[32,0,32,6],[35,0,35,6],[30,0,30,1],[30,3,30,6],[0,0,0,6],[19,0,19,1],[22,0,22,1],[23,0,23,1],[6,0,6,1],[5,2,5,6],[4,2,4,6],[15,0,15,1],[3,0,3,6],[20,0,20,1],[18,0,18,1],[7,0,7,1],[29,5,29,6],[26,3,26,4],[27,3,27,4],[28,3,28,4],[31,0,31,6],[29,0,29,1],[29,3,29,4],[26,0,26,1],[28,0,28,1],[24,3,24,6],[27,0,27,1],[26,5,26,6],[27,5,27,6],[28,5,28,6],[36,0,36,1],[33,0,33,2],[33,3,33,6],[36,5,36,6],[36,2,36,3],[34,0,34,6],[10,3,10,4],[11,0,11,2],[12,0,12,6],[16,0,16,1],[15,3,15,4],[10,5,10,6],[16,3,16,6],[4,0,4,1],[5,0,5,1],[25,0,25,2],[25,3,25,6],[17,3,17,4],[17,0,17,2],[11,3,11,6],[13,3,13,4],[14,3,14,4],[14,0,14,1],[13,0,13,1],[24,0,24,1],[8,0,8,1],[9,0,9,1],[6,3,6,4],[10,0,10,1],[9,5,9,6],[9,3,9,4],[8,3,8,6],[6,5,6,6],[7,5,7,6],[7,3,7,4]]}
["HPD SOLAR APPROVAL FORM"]
[]
[]
["Project Details1"]
["Project Name",null,{"$f":"IF(ProjectName=\"\",\"\",ProjectName)","v":""}]
["Site Address/es",null,{"$f":"IF(SiteAddress=\"\",\"\",SiteAddress)","v":""}]
["Project Design Phase",null,{"$f":"ProjectStatus","v":0},"Submission Date",null,{"$f":"IF(Date=0,\"0\",Date)","v":"0"}]
["Construction Type",null,{"$f":"IF(ConstructionType=\"\",\"\",ConstructionType)","v":""},"Eligible for Federal Solar Tax Credit",null,{"$f":"IF(TaxIncentiveEligible=\"\",\"\",TaxIncentiveEligible)","v":""}]
{"$rows_left_out":30}
{"sheet":"Roof Layout","index":7,"n_rows":14,"n_cols":6,"rows_kept":14,"cut":false,"hidden":false,"merged":[[13,0,13,6],[14,0,18,6],[1,0,1,6],[2,0,2,6],[4,0,4,6],[5,0,6,6],[12,0,12,6],[9,0,9,3],[10,0,10,6]]}
[]
["ROOF LAYOUT"]
[{"$f":"'Instructions and Assumptions'!C4","v":"        Version 2025 1.1, Updated May 2025"}]
[]
["SOLAR PV SYSTEM LAYOUT OR USABLE ROOF AREA"]
["Provide image/s of roof plan(s) with solar layout or Sustainable Roofing Zone. Please include any existing or planned equipment (e.g. HVAC systems, electrification equipment, cell towers, antennas, roof decks, LL11 rigging equipment, etc.). Please note in the comments section if green roof is being incorporated to satisfy DEP requirments. Identify key features on image or in comments section below.  Images should include any of the following to clarify design features or obstacles:"]
[]
[null,"> Sketch",null,null,"> Building Plans","> Drawings"]
{"$rows_left_out":7}
{"sheet":"Results","index":8,"n_rows":43,"n_cols":7,"rows_kept":43,"cut":false,"hidden":false,"merged":[[33,4,36,6],[11,4,11,5],[42,0,42,6],[1,0,1,6],[0,0,0,6],[32,4,32,6],[4,0,7,6],[3,0,3,6],[32,0,32,2],[8,0,8,2],[15,0,15,2],[20,0,20,2],[37,0,38,2],[8,4,8,6],[9,4,9,5],[10,4,10,5],[33,1,33,2],[34,1,34,2],[35,1,35,2],[36,1,36,2],[21,1,21,2],[22,1,22,2],[23,1,23,2],[24,1,24,2],[25,1,25,2],[26,1,26,2],[27,1,27,2],[28,1,28,2],[29,1,29,2],[30,1,30,2],[9,1,9,2],[10,1,10,2],[11,1,11,2],[12,1,12,2],[13,1,13,2]]}
["SOLAR FEASIBILITY ANALYSIS RESULTS"]
[{"$f":"'Instructions and Assumptions'!C4","v":"        Version 2025 1.1, Updated May 2025"}]
[]
[{"$f":"\"PRELIMINARY SOLAR FINANCIAL ANALYSIS: \"&ProjectName","v":"PRELIMINARY SOLAR FINANCIAL ANALYSIS: "}]
["Solar energy systems provide electricity bill savings, however they are also eligible for a number of federal, state and local incentives that can significantly improve return on investment. The summary below includes estimated costs, incentives, electricity bill savings, and payback period for a solar energy system on this property. Payback Period is estimated using the costs, savings and incentives shown in this analysis, but may not reflect the actual payback of the system as underwritten by HPD."]
[]
[]
[]
{"$rows_left_out":36}
{"sheet":"Data Validation","index":9,"n_rows":18,"n_cols":45,"rows_kept":18,"cut":false,"hidden":true,"merged":[]}
["Owner Type",null,"Yes/No",null,"Yes/No",null,"Project Eligible for Federal Solar Tax Credit?",null,"LIHTC Eligible",null,"Is Project Proposing Solar?",null,"Subject to DOB LL92/94",null,"Solar Mandate Approval",null,"HPD Program - Dropdown Options",null,"Construction Type",null,"Project Completion Year",null,"HPD Subsidy",null,"Roof Condition",null,"Electrification",null,"Bonus Federal Solar Tax Credit (%)",null,"Bonus Federal Solar Tax Credit Description",null,"Project Status",null,"Utility Provider",null,"System Type",null,"Solar Metering Configuration",null,"Con Edison Electricity Tariff (Owner-Paid)",null,"CSRP Load Zones",null,"Next Steps"]
["For-Profit Rental",null,"Yes",null,"Yes",null,"Yes (owner is a taxable entity)",null,"Yes 4%",null,"Yes - project proposing solar",null,"Yes (roof assembly is being replaced)",null,"Solar Required - payback period ≤ 10 years",null,"421a",null,"New Construction",null,2025,null,"Yes, project is receiving HPD subsidy",null,"Roof was resurfaced or replaced in the last 5 years",null,"No",null,0.1,null,"Low-Income Community",null,"Preliminary Screening/IPNA",null,"Con Edison",null,"Ballasted",null,"Behind-the-Meter",null,"EL1",null,"11:00 AM-3:00 PM",null,"1. submit to HPD using the button below\n2. await feedback on IPNA screening from Solar 1\n3. include screening in IPNA submissions to HPD\n4. submit full analysis after pre-scoping meeting"]
["Non-Profit Rental",null,"No",null,"No",null,"Yes (owner is a 501c3 - can get tax credit via Elective/Direct Pay)",null,"Yes 9%",null,"Yes - proposing solar for some buildings but not all",null,"No (roof assembly not being replaced)",null,"Solar Required on some but not all buildings - see comments",null,"ANCP",null,"Sub Rehab",null,2026,null,"No, project is only receiving a Tax Exemption",null,"Roof is getting resurfaced or replaced as part of scope",null,"Yes (explain in comments and include in roof plan)",null,0.2,null,"Qualified Low-Income Economic Benefit Project",null,"Scoping (note: submit after pre-scoping meeting)",null,"PSEG-LI",null,"Mechanically Attached",null,"CDG (Solar Export Meter)",null,"EL2",null,"2:00 PM-6:00 PM",null,"1. Submit to HPD using the button below\n2. Await feedback from Solar 1\n3. Utilize Results to inform compliance with LL92/94"]
["Co-op/Condo",null,null,null,"Some, but not all",null,"Yes (owner will sell credit via transferability)",null,"No",null,"No - project includes green roof over 90% of roof area",null,"Unknown (roof work to be determined)",null,"Solar Strongly Recommended - see comments",null,"ELLA",null,"Mod Rehab",null,2027,null,"No, project is a Maintenance-Only scope",null,"Other (explain in the Roof Layout comments section)",null,null,null,null,null,"Qualified Low-Income Residential Building Project",null,"Design Revisions",null,null,null,"Canopy",null,null,null,"EL8",null,"4:00 PM-8:00 PM",null,"1. Submit to HPD using the button below.\n2. Await results from Solar 1 and HPD’s Sustainability Office.\n3. Save HPD Approval Form in project records."]
["Limited Partnership",null,null,null,null,null,"No (owner is a co-op/condo with no tax liability)",null,null,null,"No - project cannot support > 4kW",null,null,null,"Solar Recommended - see comments",null,"GHPP",null,"Gut Rehab",null,2028,null,"No, project is in the Delegated Loan program",null,null,null,null,null,null,null,"Other (please explain in notes section)",null,"Post-Bid",null,null,null,null,null,null,null,"EL9",null,"7:00 PM-11:00 PM"]
[null,null,null,null,null,null,"No (explain in Applicant Comments)",null,null,null,"No - solar is not cost effective",null,null,null,"Solar Not Required - green roof over 90% of sustainable roofing zone",null,"HRP",null,null,null,2029,null,null,null,null,null,null,null,null,null,null,null,"Post- Closing",null,null,null,null,null,null,null,"EL12"]
[null,null,null,null,null,null,null,null,null,null,"No - see comments",null,null,null,"Solar Not Required - cannot support >4kW",null,"HUD Multi Family",null,null,null,2030]
[null,null,null,null,null,null,null,null,null,null,null,null,null,null,"Solar Not Required - payback period > 10 years",null,"LIHTC YR 15"]
{"$rows_left_out":11}
{"sheet":"Assumptions Calcs & Lookups","index":10,"n_rows":137,"n_cols":15,"rows_kept":137,"cut":false,"hidden":true,"merged":[[1,7,1,9],[2,0,2,2],[16,0,16,1],[18,0,18,1],[14,8,14,10],[15,8,15,10],[16,8,16,10],[17,8,17,10],[13,8,13,10],[18,8,18,10],[2,7,2,9],[2,10,3,10],[20,8,20,10],[32,0,32,1],[116,0,116,1],[54,0,54,1],[62,0,62,1],[35,0,35,1],[76,0,76,1],[92,0,92,1],[98,0,98,2],[110,0,110,1],[47,0,47,1],[33,0,33,1],[71,8,71,9],[2,11,3,11],[2,12,3,12],[2,13,3,13],[2,14,3,14],[19,8,19,10]]}
["Assumptions, Calculations and Lookup Tables"]
[null,null,null,null,null,null,null,"Project Completion Year:",null,null,{"$f":"IF(ProjectCompletionYearIN=\"\",'Assumptions Calcs & Lookups'!H5,ProjectCompletionYearIN)","v":2024}]
["System Price Estimate ($/Watt-DC)",null,null,"<- Update every 12 months",null,null,null,"Incentives",null,null,"NY-Sun >1 MW","NY-Sun >200kW","NY-Sun <200kW","NY-Sun Affordable Adder","NY-Sun Affordable CDG"]
["Min (kW-DC)","Max (kW-DC)","Price ($/Watt-DC)",null,null,null,null,"Year","ITC","RETC"]
[4,9.99,5.7,null,null,null,null,2024,0.3,0.3,0.5,0.6,0.6,{"$f":"1.6-M5","v":1},{"$f":"2-M5-N5","v":0.39999999999999991}]
[10,19.989999999999998,4.88,null,null,null,null,2025,0.3,0.3]
[20,29.99,4.16,null,null,null,null,2026,0.3,0.3]
[30,44.99,3.83,null,null,null,null,2027,0.3,0.3]
{"$rows_left_out":130}
{"sheet":"HPD Underwriting","index":11,"n_rows":46,"n_cols":5,"rows_kept":46,"cut":false,"hidden":true,"merged":[[11,0,11,2],[4,0,4,3],[5,0,6,3],[7,0,7,3],[8,0,8,2],[10,0,10,2],[9,0,9,2],[22,0,22,2],[12,0,12,2],[13,0,13,2],[14,0,14,2],[16,0,16,3],[17,0,17,2],[18,0,18,2],[19,0,19,2],[20,0,20,2],[21,0,21,2],[36,0,36,2],[23,0,23,2],[25,0,25,3],[26,0,26,2],[27,0,27,2],[28,0,28,2],[29,0,29,2],[30,0,30,2],[31,0,31,2],[32,0,32,2],[33,0,33,2],[35,0,35,3],[43,0,43,2],[44,0,44,2],[45,0,45,2],[37,0,37,2],[38,0,38,2],[39,0,39,2],[40,0,40,2],[41,0,41,2],[42,0,42,2]]}
[]
[null,null,"   Solar Underwriting Tool"]
[null,null,{"$f":"RIGHT(Results!A2,48)","v":"        Version 2025 1.1, Updated May 2025"}]
[]
["User Inputs"]
["User to fill in all Highlighted Cells (blue). All other cells will be automatically populated/calculated. This tool can be used to assess preliminary solar financial viability for an NYC affordable housing property from an HPD underwriting perspective."]
[]
["Inputs from Solar Screening Tool or Solar Designer"]
{"$rows_left_out":39}
{"sheet":"25 Year Cash Flow","index":12,"n_rows":29,"n_cols":17,"rows_kept":29,"cut":false,"hidden":true,"merged":[]}
["25 Year Cashflow"]
[]
["Year","Solar Energy Production (kWh)","Value of Solar ($/kWh)","Customer Benefit Contribution (Behind-the-Meter)","New Meter Fees (CDG Only)","Net Electricity Bill Savings","Upfront System Cost","Inverter Replacement","Federal Tax Credit","LIHTC","Property Tax Abatement","NYS Tax Credit","NYS Historic Tax Credit","Increased Federal Taxes Due to State Tax Credits","Balance","Balance (No Tax Incentives)","Cash Inflows and Outflows"]
[0,null,null,null,null,null,{"$f":"UpfrontCost","v":{"$error":"#N/A"}},null,null,null,null,null,null,null,{"$f":"SUM(F4:N4)","v":{"$error":"#N/A"}},{"$f":"O4","v":{"$error":"#N/A"}},{"$f":"SUM(F4:N4)","v":{"$error":"#N/A"}}]
[1,{"$f":"Y1SolarProduction","v":{"$error":"#N/A"}},{"$f":"Y1VoS","v":{"$error":"#N/A"}},{"$f":"NEMAnnualCBC","v":0},{"$f":"CDGAnnualMeterFee","v":0},{"$f":"(B5*C5)+SUM(D5:E5)","v":{"$error":"#N/A"}},null,null,{"$f":"ITC+SUM('Assumptions Calcs & Lookups'!B123:B125)","v":{"$error":"#N/A"}},{"$f":"TenYearLIHTCValue/10","v":{"$error":"#N/A"}},{"$f":"NYCPTA/4","v":0},{"$f":"NYSResidentialTaxCredit","v":0},{"$f":"NYSHistoricTaxCredit","v":0},{"$f":"IncreasedFedTaxesDue_to_State_Incentives","v":0},{"$f":"O4+SUM(F5:N5)","v":{"$error":"#N/A"}},{"$f":"P4+F5+H5","v":{"$error":"#N/A"}},{"$error":"#N/A"}]
[2,{"$f":"B5*(1-AnnualPVDegradation)","v":{"$error":"#N/A"}},{"$f":"C5*(1+VoSEscalator)","v":{"$error":"#N/A"}},0,{"$f":"CDGAnnualMeterFee","v":0},{"$f":"(B6*C6)+SUM(D6:E6)","v":{"$error":"#N/A"}},null,null,null,{"$f":"TenYearLIHTCValue/10","v":{"$error":"#N/A"}},{"$f":"NYCPTA/4","v":0},null,null,null,{"$error":"#N/A"},{"$error":"#N/A"},{"$error":"#N/A"}]
[3,{"$error":"#N/A"},{"$error":"#N/A"},0,0,{"$error":"#N/A"},null,null,null,{"$error":"#N/A"},{"$f":"NYCPTA/4","v":0},null,null,null,{"$error":"#N/A"},{"$error":"#N/A"},{"$error":"#N/A"}]
[4,{"$error":"#N/A"},{"$error":"#N/A"},0,0,{"$error":"#N/A"},null,null,null,{"$error":"#N/A"},{"$f":"NYCPTA/4","v":0},null,null,null,{"$error":"#N/A"},{"$error":"#N/A"},{"$error":"#N/A"}]
{"$rows_left_out":22}
{"sheet":"Change Log","index":13,"n_rows":300,"n_cols":3,"rows_kept":300,"cut":false,"hidden":true,"merged":[[295,0,295,1],[289,0,289,1],[130,0,130,1]]}
["CHANGE LOG"]
["Last updated by Alex Federico on 5/13/25"]
["2025-05-01"]
["Item","Description"]
["NY-Sun <200kW and >200kW","Updated rates to $0.60"]
["NY-Sun Affordable & Affordable CDG","Changed from hardcorded rates to formulas. $1.60 minus the NY-Sun <200kW rate & $2.00 minus the NY-Sun <200kW rate"]
["2025-03-01"]
["Item","Description"]
{"$rows_left_out":292}