gender,census_new,age_911grp,age_intgrp_w5,NYCity,education,employed_911,income_w5,marital_w5,cohabit_w5,curr_employmentw5,BMI_cat,usermode_w5,s_s_occ_trans,resident_e,worker_e,any_injury,witness_count,femarating,work_pile,m1_leave_f1,dust_intensity,damage_condition,dust_condition,sf12_genhlth_w5,sf12_calm_4wks_w5,sf12_downhearted_4wks_w5,sf12_energy_4wks_w5,sf12_limit_activities_w5,sf12_limit_stairs_w5,sf12_mh_accomplish_4wks_w5,sf12_mh_careful_4wks_w5,sf12_pain_4wks_w5,sf12_phys_accomplish_4wks_w5,sf12_phys_limited_4wks_w5,sf12_social_4wks_w5,assistive_device_w5,cml_12m_w5,cml_worse_12m_w5,cml_nochores_12m_w5,cml_assistance_w5,cml_get_help_w5,cml_interfere_12m_w5,cml_discuss_w5,dental_last_visit_w5,phys_active_w5,physhlth_w5,menthlth_w5,poorhlth_w5,physhlth_YorN_W5,menthlth_YorN_W5,poorhlth_YorN_W5,brthless_noflu_30d_w5,brthless_noflu_30d_awake_w5,cough_noflu_30d_w5,cough_noflu_30d_awake_w5,wheeze_noflu_30d_w5,wheeze_noflu_30d_awake_w5,inhaler_30d_w5,htburn_12m_freq_w5,htburn_30d_meds_w5,hypertension_w5,cholesterol_w5,angina_w5,heart_attack_w5,chd_w5,stroke_w5,diabetes_w5,chbronch_w5,emphys_copd_w5,rads_w5,chsinusitis_w5,sleep_apnea_w5,gerd_w5,thyroid_w5,periph_neurop_w5,hearing_loss_w5,gum_disease_w5,chpain_w5,other_dis_w5,asthma_w5,psa_test_12m_w5,mammogram_12m_w5,autoimm_w5,health_insurance_w5,health_noinsur_12m_w5,routine_checkup_w5,unmet_need_phys_12m_w5,unmet_need_mh_12m_w5,sad_w5,nervous_w5,restless_w5,hopeless_w5,lethargic_w5,worthless_w5,depression_w5,nerves_w5,family_prob_12m_w5,rx_pain_12m_w5,selfeff_try_w5,selfeff_want_w5,selfeff_accomplish_w5,selfeff_efficient_w5,selfeff_resourceful_w5,selfeff_effort_w5,selfeff_coping_w5,selfeff_solutions_w5,selfeff_think_w5,selfeff_handle_w5,wtcprog_services_w5,wtchp_need_care_w5,socsupp_doctor_w5,socsupp_goodtime_w5,socsupp_hug_w5,socsupp_meals_w5,socsupp_probs_w5,socsupp_comm_w5,socsupp_religious_w5,socsupp_club_w5
1,1,4,4,2,6,1,4,2,2,2,4,PAPER,0,0,1,2,2,,,,1,,,3,2,4,2,3,3,4,4,3,4,4,4,2,2,,,,,,,1,2,1,0,0,1,2,2,2,,2,,2,,2,5,1,1,2,1,2,1,2,2,2,2,2,2,1,1,2,2,1,2,2,2,2,1,,2,1,2,1,2,2,1,1,1,1,1,1,2,2,2,2,4,2,3,4,4,4,4,4,4,4,2,,5,5,5,5,5,2,1,2
1,3,3,4,2,6,1,6,3,2,1,3,WEB,0,0,1,2,2,,2,,1,,,3,2,4,2,3,3,4,4,1,4,4,4,2,2,,,,,,,1,2,0,1,0,2,1,2,2,,2,,2,,2,2,1,1,2,2,2,2,2,2,2,2,2,2,2,2,2,2,2,2,2,2,2,1,,2,1,2,1,2,2,1,1,2,1,1,1,2,2,2,2,4,4,4,4,4,4,4,4,4,4,2,,5,5,2,3,3,1,2,1
2,1,4,4,2,5,1,1,2,2,2,2,PAPER,0,0,1,2,2,,2,,1,,,3,4,4,4,1,3,3,3,3,3,3,3,2,2,,,,,,,3,2,1,2,2,1,1,1,,,,,1,1,2,1,,1,1,2,1,2,2,1,2,2,2,1,2,2,2,2,1,2,2,2,2,,1,2,1,2,1,2,1,3,3,3,2,3,2,1,2,2,2,3,3,3,3,3,3,3,3,3,3,2,3,4,4,3,5,4,1,2,2
1,1,4,4,2,5,1,4,2,2,2,3,PAPER,0,0,1,2,2,,1,,1,,,4,3,3,3,2,1,3,3,2,3,3,4,2,1,1,1,2,,2,2,1,3,1,1,1,1,1,1,1,1,2,,2,,2,2,1,1,1,2,2,2,2,2,2,2,2,1,1,2,2,2,1,2,2,1,2,1,,2,1,2,1,1,1,2,2,3,2,2,2,1,1,2,2,4,3,3,3,3,4,3,3,3,3,2,,5,2,1,4,2,1,2,1
1,1,4,4,2,5,1,6,1,,1,3,PAPER,0,0,1,2,2,,2,,1,,,4,3,3,4,2,1,4,4,1,3,4,4,2,2,,,,,,,3,3,0,0,0,2,2,2,1,2,2,,2,,2,2,1,1,1,2,2,2,2,2,2,2,2,2,2,2,2,2,2,2,2,2,2,2,,2,1,2,1,2,2,1,1,1,1,1,1,2,2,2,2,3,2,3,3,3,3,4,3,3,3,2,,5,5,4,4,4,1,2,2
1,1,4,4,2,7,1,3,1,1,1,3,PAPER,0,0,1,2,2,,1,,1,,,2,2,4,2,3,3,4,4,2,4,4,4,2,2,,,2,,2,2,1,1,0,0,0,2,2,2,2,,2,,2,,2,1,,2,1,2,2,2,2,2,2,2,2,2,2,2,2,2,1,2,2,2,1,2,,2,1,2,1,2,2,1,1,1,1,1,1,2,2,2,2,4,3,4,4,4,4,4,4,4,4,2,,4,4,4,4,4,1,1,1
2,1,4,4,2,4,2,,1,,2,3,PAPER,0,0,1,2,2,,2,,1,,,3,4,3,4,2,2,4,3,3,4,4,4,2,2,,,,,,,3,2,2,1,1,1,1,1,1,2,,,,,2,4,1,1,1,2,2,2,2,2,2,2,2,2,2,1,2,2,2,2,2,2,2,,2,2,1,2,2,2,2,2,2,2,1,2,1,2,2,1,2,4,3,3,3,3,4,3,3,3,3,3,,5,4,4,4,4,1,1,2
1,1,4,4,2,4,2,1,1,,2,3,PAPER,0,0,1,2,2,,2,,1,,,3,2,4,3,2,2,3,3,2,3,3,4,2,2,,,,,,,1,2,1,1,1,1,1,1,2,,2,,2,,2,4,2,1,2,2,2,2,2,2,2,2,2,2,2,2,2,2,1,2,2,2,2,2,,2,1,2,1,2,2,1,1,1,1,1,1,2,2,2,2,3,3,3,3,3,3,3,3,3,3,2,2,5,5,5,5,5,1,2,2
1,1,4,4,2,5,1,6,1,,2,3,PAPER,0,0,1,2,2,,1,,1,,,3,3,4,3,3,2,4,4,3,,4,4,1,2,,,,,,,1,2,0,0,0,2,2,2,1,2,2,,2,,,1,,1,2,2,2,2,2,2,2,2,2,1,2,2,2,1,1,2,2,2,2,2,,2,1,2,1,2,2,1,1,1,1,1,1,2,2,2,2,3,3,3,3,3,3,3,3,3,3,2,2,5,4,3,5,2,1,1,1
1,1,4,4,2,7,1,5,2,1,2,2,WEB,0,0,1,2,2,,2,,1,,,1,2,4,2,3,3,4,4,1,4,4,4,2,2,,,,,,,1,1,0,0,0,2,2,2,2,,2,,2,,2,1,,2,2,2,2,2,2,2,2,2,2,2,2,2,2,2,1,1,2,2,2,2,,2,1,2,2,2,2,1,1,1,1,1,1,2,2,2,2,4,3,4,4,4,4,4,4,4,4,2,,4,5,4,5,4,1,2,1
1,1,4,4,1,6,2,4,1,,2,4,PAPER,0,0,1,2,2,,1,,1,,,2,3,3,3,2,2,3,3,3,3,3,3,2,2,,,,,,,1,2,1,1,1,1,1,1,2,,2,,2,,2,1,,1,2,2,2,2,2,2,2,2,2,2,1,2,2,2,2,2,2,2,2,1,,2,1,2,1,2,1,2,2,2,2,2,2,1,2,2,1,4,3,2,3,3,3,3,3,3,3,1,2,2,3,3,1,4,1,2,2
1,1,4,4,2,4,1,5,1,,1,4,WEB,0,0,1,2,2,,2,,1,,,3,2,4,2,3,3,4,4,1,4,4,4,2,2,,,,,,,1,2,0,0,0,2,2,2,2,,2,,2,,2,1,,1,2,2,2,2,2,2,2,2,2,2,2,2,2,2,2,2,2,2,2,2,,2,2,2,1,2,2,1,1,1,1,1,1,2,2,2,2,3,3,3,3,3,3,2,3,3,3,3,2,5,5,5,5,5,1,2,2
1,1,4,4,2,6,1,6,1,,1,3,PAPER,0,0,1,2,2,,1,,1,,,2,2,4,2,3,3,4,4,1,4,4,4,2,2,,,,,,,1,2,0,0,0,2,2,2,2,,2,,2,,2,3,2,1,1,2,2,2,2,2,2,2,2,2,2,2,2,2,2,2,2,2,2,1,,2,1,2,1,2,2,1,1,1,1,1,1,2,2,2,2,4,,4,4,4,4,4,4,4,4,2,,5,5,5,5,5,1,2,1
1,4,4,4,2,6,2,5,1,,2,3,PAPER,0,0,1,2,2,,2,,1,,,4,4,2,4,1,1,2,2,4,2,2,2,2,1,1,1,1,,1,1,1,4,,0,2,,2,1,2,2,2,2,2,2,2,2,2,2,2,2,2,2,2,1,2,2,2,2,2,2,2,2,2,2,1,2,2,2,,2,1,2,1,2,1,2,2,,,,4,1,2,2,2,3,2,2,2,2,3,2,2,2,2,2,1,3,2,2,2,2,2,2,2
1,1,4,4,2,6,1,5,1,,2,2,WEB,0,0,1,2,2,,2,,1,,,2,2,2,3,2,2,4,4,2,3,3,4,2,1,1,2,2,,2,2,1,2,1,1,,1,1,,1,2,2,,2,,2,3,2,1,2,2,2,2,2,2,2,2,2,2,2,2,2,2,1,2,2,2,2,1,,2,1,,1,2,2,2,2,2,2,2,1,2,2,2,2,4,3,3,3,3,3,3,3,3,4,2,,5,3,4,5,3,1,1,2
2,3,4,4,2,6,1,4,1,,2,3,WEB,0,0,1,2,2,,2,,1,,,3,2,4,2,2,1,4,4,3,4,4,4,2,1,1,1,2,,2,1,1,2,0,0,0,2,2,2,1,1,1,1,1,1,1,2,1,1,1,2,2,1,2,1,2,2,2,2,2,1,2,1,2,2,1,2,1,,2,1,1,2,1,2,2,1,1,1,1,1,1,2,2,2,1,4,2,3,3,3,4,2,2,3,3,2,3,5,3,5,5,5,1,1,1
1,1,3,4,2,6,1,5,2,2,1,4,WEB,0,0,1,2,2,,2,,1,,,2,2,4,2,3,3,4,4,2,4,4,4,2,2,,,,,,,3,2,1,1,1,1,1,1,2,,1,1,2,,1,2,2,2,2,2,2,2,2,2,2,2,2,2,2,2,2,2,2,2,2,2,2,2,,2,1,2,1,2,2,2,2,2,2,2,2,1,2,2,2,3,3,3,3,3,3,3,3,3,3,2,,4,4,3,2,4,1,2,2
2,3,4,4,1,5,1,4,3,,2,4,PAPER,1,0,1,2,,,2,,1,,,3,3,4,3,3,3,3,4,3,4,4,2,1,2,,,,,,,1,3,1,1,1,1,1,1,1,2,2,,1,1,1,3,1,1,1,2,2,2,2,1,2,2,2,2,1,2,1,,2,1,2,2,1,,2,2,1,2,1,2,2,1,2,2,1,2,1,2,2,2,1,4,2,3,3,4,4,4,4,4,4,2,,5,4,5,5,5,1,1,2
1,1,3,4,2,7,1,3,1,1,1,2,PAPER,0,0,1,2,2,,1,,1,,,2,2,4,4,3,2,4,4,2,4,4,2,2,2,,,,,,,3,2,2,1,2,1,1,1,1,2,2,,2,,2,3,2,1,1,2,2,2,2,2,2,2,2,2,2,2,2,2,2,2,2,2,2,1,,2,1,2,2,2,2,1,2,2,1,1,1,2,2,1,1,4,3,3,4,4,4,3,4,4,4,2,1,3,4,4,4,1,1,2,2
1,1,4,4,2,6,1,4,1,,2,3,WEB,0,0,1,2,2,,1,,1,,,3,2,4,2,3,3,4,4,2,3,4,4,2,2,,,,,,,1,2,0,0,0,2,2,2,2,,2,,2,,1,1,,1,2,2,2,2,2,1,2,2,2,2,2,2,2,2,2,2,2,2,1,1,,2,1,2,1,2,2,1,1,1,1,1,1,2,2,2,1,3,3,4,4,4,4,4,4,4,4,2,,4,3,5,5,4,1,2,2
1,4,3,4,2,7,1,4,1,,2,2,PAPER,0,0,1,2,2,,1,,1,,,3,2,3,3,1,1,3,4,4,2,2,3,2,2,,,,,,,1,2,1,1,1,1,1,1,2,,2,,2,,2,3,1,2,1,2,2,2,2,2,2,2,2,1,1,1,2,2,1,2,1,,2,1,,2,1,2,1,1,1,1,2,2,1,1,1,1,2,1,1,4,3,3,3,3,4,2,3,3,3,2,2,5,4,5,5,5,1,2,2
2,1,3,4,2,7,1,4,2,2,2,,PAPER,0,0,1,2,2,,1,,1,,,1,2,4,2,3,3,4,4,1,4,4,4,2,2,,,,,,,1,1,0,0,0,2,2,2,2,,2,,2,,2,1,,2,2,2,2,2,2,2,2,2,2,2,2,2,2,2,2,2,2,2,2,,2,1,1,2,3,2,2,1,1,1,1,1,1,2,2,2,2,4,3,4,4,4,4,4,4,4,4,2,,5,4,4,5,4,1,2,2
2,1,4,4,2,5,1,2,2,2,2,2,WEB,0,0,1,2,2,,2,,1,,,3,3,4,3,2,1,4,4,2,3,3,4,1,2,,,,,,,3,2,0,0,0,2,2,2,2,,2,,2,,2,1,,1,2,2,2,2,2,2,2,2,2,2,2,2,1,2,1,2,2,2,2,,2,2,1,2,2,2,2,1,1,1,1,1,1,2,2,2,2,3,3,2,3,3,3,3,3,3,3,2,,5,4,3,5,3,1,2,2
1,1,4,4,2,6,1,6,1,,1,2,WEB,0,0,1,1,2,,1,,1,,,1,2,4,2,3,3,4,4,1,4,4,4,2,2,,,,,,,3,1,0,0,0,2,2,2,2,,2,,2,,2,2,2,1,1,2,2,2,2,2,2,2,2,2,2,2,2,2,2,2,2,2,2,2,,2,1,2,3,2,2,1,1,1,1,1,1,2,2,2,2,4,3,4,4,4,4,4,4,4,4,2,,5,5,4,5,5,1,2,1
1,1,4,4,2,7,1,3,3,2,1,4,WEB,0,0,1,2,2,,1,,1,,,2,2,4,3,3,2,4,4,2,4,4,2,2,2,,,,,,,1,3,1,1,1,1,1,1,2,,2,,2,,2,2,1,2,1,2,2,2,2,2,2,2,2,2,2,1,2,2,2,2,2,2,2,1,,2,1,2,1,2,2,1,1,2,2,2,1,2,2,2,2,3,3,3,3,3,3,3,3,4,4,2,,4,4,4,3,3,1,2,2
1,1,3,4,2,6,1,6,3,2,1,2,PAPER,0,0,1,2,2,,1,,1,,,3,3,4,3,3,3,4,4,1,4,4,4,2,2,,,,,,,1,1,0,0,1,2,2,1,2,,2,,2,,2,3,2,2,1,2,2,2,2,2,2,2,2,2,2,2,2,2,2,2,2,2,2,2,,2,1,2,2,2,2,1,1,1,1,1,1,2,2,2,2,4,3,3,4,4,4,4,4,4,4,2,,2,2,2,2,3,1,2,2
2,3,3,4,2,4,1,3,3,1,1,4,PAPER,0,0,1,2,2,,2,,1,,,3,2,3,2,2,2,4,4,2,4,4,3,2,2,,,,,,,2,2,1,1,1,1,1,1,2,2,2,2,2,2,2,1,,2,2,2,2,2,2,2,2,2,2,2,2,2,2,2,2,2,2,2,2,,1,2,1,2,1,2,2,1,2,2,1,1,1,2,2,2,1,4,3,4,4,4,4,4,3,4,4,2,,5,4,5,4,4,1,2,2
1,1,4,4,2,6,1,4,1,,2,3,WEB,0,0,1,2,2,,1,,1,,,4,4,3,3,2,1,3,2,4,2,2,2,1,1,1,1,2,,1,1,1,2,1,1,2,1,1,1,1,1,1,2,1,2,,4,1,1,1,1,1,1,1,2,2,2,1,1,1,1,2,2,1,2,1,2,1,2,,2,1,2,1,2,2,2,4,4,2,3,1,1,1,1,1,3,3,3,3,3,4,2,3,3,2,2,,1,2,2,2,1,1,2,1
1,1,4,4,2,5,1,3,1,,2,4,WEB,0,0,1,2,1,,2,,1,,,4,4,3,4,2,2,3,2,3,3,3,3,2,1,,2,2,,2,2,1,3,1,1,1,1,1,1,1,2,1,2,,,,1,,1,1,2,2,1,2,1,2,2,2,2,2,2,2,2,1,2,2,2,2,1,,2,1,2,1,2,2,1,1,1,1,1,1,2,2,2,1,4,2,3,3,3,4,4,4,3,4,2,,5,5,5,5,5,1,2,2
2,1,4,4,2,7,1,1,2,2,2,3,PAPER,0,0,1,2,2,,2,,1,,,1,2,3,3,3,2,4,4,1,4,4,2,2,1,2,2,2,1,2,2,2,1,0,1,0,2,1,2,1,2,2,,2,,2,5,2,2,2,2,2,2,2,2,2,2,2,2,2,2,2,2,1,2,2,2,2,,2,2,1,2,3,2,2,1,1,1,2,2,3,2,2,1,,4,3,4,4,4,4,4,4,4,4,2,,5,3,3,3,4,2,2,2
1,1,4,4,2,5,1,2,2,2,2,4,PAPER,0,0,1,2,2,,2,,1,,,3,2,4,3,2,2,4,4,4,3,3,4,2,2,,,,,,,3,2,0,0,0,2,2,2,2,,2,,2,,2,1,,2,1,2,2,2,1,1,2,2,2,2,2,2,2,2,2,2,1,2,2,1,,2,1,2,1,2,2,1,1,1,1,1,1,2,2,2,2,4,4,4,4,4,4,4,4,4,4,2,,5,4,4,5,5,1,2,2
1,1,4,4,2,5,1,3,2,1,1,3,PAPER,0,0,1,2,2,,2,,1,,,2,2,4,2,2,2,4,4,3,3,3,4,2,1,,,2,1,2,2,3,2,1,1,1,1,1,1,2,2,2,2,2,2,1,5,1,1,2,1,2,1,2,2,2,2,2,1,1,2,2,2,1,2,1,2,2,1,,2,1,2,1,2,2,2,2,2,2,2,2,1,2,2,1,2,2,,3,3,3,3,3,4,3,1,1,5,4,4,4,4,1,1,1
1,3,4,4,2,5,1,3,1,,2,2,PAPER,0,0,1,2,2,,2,,1,,,3,2,4,3,3,2,3,4,2,3,2,4,2,2,,,,,,,2,2,1,1,1,1,1,1,2,,2,,2,,2,1,,1,2,2,2,1,2,2,2,2,2,2,2,2,2,2,2,2,2,1,,1,,,1,2,1,2,2,1,,1,1,2,1,2,2,2,2,3,3,3,3,3,4,3,4,3,4,2,2,5,4,5,5,5,1,2,2
2,3,4,4,2,5,,1,2,2,2,4,PAPER,0,0,1,2,2,,2,,1,,,4,3,3,3,1,1,2,2,4,2,2,2,1,1,1,1,1,2,,2,1,3,2,2,2,1,1,1,1,1,2,,2,,2,3,1,1,2,,1,1,2,1,2,2,2,2,1,1,1,1,2,2,1,2,1,,1,,1,2,1,2,2,2,1,1,1,1,1,2,2,2,2,3,2,3,3,2,2,2,3,3,3,2,3,2,2,2,1,2,1,1,2
1,3,4,4,2,7,2,4,2,2,1,4,PAPER,0,0,1,2,1,,2,,1,,,4,2,4,4,2,2,4,4,3,3,3,2,1,2,,,,,,,2,2,1,0,1,1,2,1,2,,2,,2,,2,2,2,1,,,,1,,,,,,,,,,,,,,,2,1,,2,1,2,1,2,2,1,1,1,1,1,1,2,2,2,1,3,3,3,3,3,3,3,3,3,3,2,,4,4,4,4,4,1,1,2
1,1,4,4,2,7,1,4,1,,2,3,WEB,0,0,1,2,2,,2,,1,,,3,2,4,2,3,3,4,4,1,4,3,4,2,2,,,,,,,1,2,0,0,0,2,2,2,2,,2,,2,,2,1,,1,1,1,1,1,2,1,2,2,2,2,2,2,2,2,2,2,2,2,2,2,,2,1,2,1,2,2,1,1,1,1,1,1,2,2,2,2,4,3,3,4,4,4,4,4,4,4,2,,5,5,5,5,5,1,1,1
2,1,3,4,2,6,1,5,1,,2,2,PAPER,0,0,1,2,2,,1,,1,,,2,4,3,3,3,3,4,4,1,4,4,4,2,2,,,,,,,1,2,0,1,0,2,1,2,2,,2,,2,,2,2,1,2,2,2,2,2,2,2,2,2,2,2,2,2,2,1,2,2,2,,2,,1,2,1,2,3,2,2,1,1,1,2,1,1,1,2,2,2,4,2,3,4,4,4,3,3,4,4,2,,5,5,5,5,5,1,2,1
2,4,3,4,2,5,1,5,1,,1,2,PAPER,0,0,1,2,2,,2,,1,,,2,2,4,2,3,3,4,4,1,4,4,4,2,2,,,,,,,3,2,1,1,1,1,1,1,2,,2,,2,,2,4,1,2,2,2,2,2,2,2,2,2,2,2,2,2,2,2,2,1,2,,1,,1,,1,2,1,2,2,1,1,1,1,1,1,2,2,2,2,3,3,3,3,3,3,3,3,3,3,2,,5,4,4,4,4,1,1,2
1,1,4,4,2,7,1,6,1,,2,3,WEB,0,0,1,2,2,,1,,1,,,3,2,4,3,3,3,4,4,1,4,4,2,1,1,1,2,1,1,2,1,1,2,0,1,0,2,1,2,2,,2,,2,,2,1,,1,1,2,2,2,2,1,2,2,2,2,2,2,1,2,1,2,2,2,2,2,,2,1,2,1,2,2,4,2,1,1,1,1,2,1,2,2,4,3,4,4,4,4,3,4,4,4,2,,5,5,5,5,5,1,2,1
1,3,4,4,2,5,1,2,1,,2,3,WEB,0,0,1,1,2,,2,,1,,,4,3,4,4,1,1,2,2,4,2,2,2,2,2,,,,,,,1,3,2,0,2,1,2,1,1,1,1,1,1,2,1,5,1,1,1,2,1,2,1,2,2,1,2,2,2,1,2,2,2,2,1,2,2,1,,2,1,2,1,2,2,1,1,1,1,1,1,2,2,2,2,4,3,4,4,4,4,4,4,4,4,2,,5,5,5,5,5,1,1,2
2,3,3,4,2,6,1,5,2,2,1,3,PAPER,0,0,1,2,2,,2,,1,,,1,2,4,2,3,3,4,4,1,4,4,4,2,2,,,,,,,3,1,0,0,0,2,2,2,2,,2,,2,,2,1,,1,1,2,2,2,2,1,2,2,2,2,2,2,2,2,2,2,2,2,2,,2,2,1,2,1,2,2,1,1,1,1,1,1,2,2,2,2,4,4,4,4,4,4,4,4,4,4,1,,5,5,5,5,5,1,2,2
2,3,4,4,2,5,2,1,3,2,1,4,WEB,0,0,1,2,2,,2,,1,,,2,3,4,3,3,2,4,4,2,4,4,3,2,2,,,,,,,1,2,1,1,1,1,1,1,1,2,2,,2,,2,3,1,1,1,2,2,2,2,2,2,2,2,2,2,2,2,2,2,2,2,2,2,,2,2,1,2,1,2,2,1,2,1,1,1,1,2,2,2,1,4,4,3,4,4,4,4,4,4,4,2,,3,3,3,3,3,1,2,1
1,1,4,4,2,7,1,4,1,,1,4,PAPER,0,0,1,2,2,,2,,1,,,2,2,4,2,3,3,3,4,2,4,4,4,2,2,,,,,,,1,1,0,0,1,2,2,1,2,,2,,2,,2,1,,2,2,2,2,2,2,2,2,2,2,2,1,2,1,2,2,2,2,2,2,2,,2,1,2,1,2,2,1,1,1,1,1,1,2,2,2,2,3,3,3,3,3,3,3,3,3,3,2,,5,5,5,5,5,1,2,1
1,1,4,4,2,6,1,,1,,2,3,PAPER,0,0,1,2,2,,2,,1,,,4,,,,1,1,2,2,4,2,2,,1,2,,,,,,,1,3,2,2,2,1,1,1,1,1,1,1,1,1,1,1,,2,1,2,2,2,2,2,2,2,2,2,1,2,2,2,1,2,2,2,2,2,,2,,,1,2,2,,,,,,,,,,2,,,,,,,,,,,3,,,,,,,1,2,2
2,4,4,4,1,7,1,5,1,,1,4,PAPER,0,0,1,2,2,,2,,1,,,3,3,3,4,3,2,3,4,1,3,3,4,2,2,,,,,,,2,3,0,2,0,2,1,2,2,,2,,2,,2,1,,2,2,2,2,2,2,2,2,2,2,2,2,2,2,2,2,2,2,2,2,,2,2,1,2,1,1,2,3,1,1,3,2,1,2,2,2,2,3,2,3,3,3,3,3,3,3,3,1,,5,5,5,5,5,1,2,1
1,4,3,4,1,6,2,3,3,2,1,3,PAPER,1,0,1,2,1,3,2,,2,,,3,4,3,2,2,,3,4,3,4,4,3,1,1,1,2,2,2,2,2,2,2,1,2,1,1,1,1,1,1,1,1,1,2,2,2,2,1,1,2,2,2,2,1,2,2,2,,2,,2,2,2,1,1,2,2,2,,2,1,2,1,2,1,3,4,4,2,4,1,1,1,2,1,3,3,2,3,2,3,3,4,3,3,1,2,1,3,2,1,2,1,1,1
1,1,4,4,2,5,1,6,1,,1,4,WEB,1,0,1,2,1,,2,,3,,,3,2,4,2,3,2,4,4,1,4,4,4,1,2,,,,,,,1,3,0,0,0,2,2,2,2,,1,2,2,,2,1,,1,1,2,1,1,2,1,2,2,2,1,1,1,2,2,1,1,2,2,2,1,,2,1,2,1,2,2,1,1,1,1,1,1,2,2,2,2,4,3,3,4,4,3,3,4,4,3,1,,5,4,4,4,4,1,2,2
2,1,4,4,2,6,1,1,2,2,2,,PAPER,0,0,1,2,2,,2,,1,,,4,4,2,4,1,1,2,3,4,2,2,2,2,1,1,2,2,2,1,1,1,3,2,2,2,1,1,1,1,2,,,,,1,3,1,2,1,2,2,2,2,2,2,1,2,2,2,2,2,2,2,2,1,2,2,,1,2,1,2,2,2,2,2,4,1,3,4,2,1,2,2,2,3,2,2,3,3,3,3,2,3,3,2,,2,2,3,3,2,1,2,2
1,1,4,4,2,5,1,5,1,,2,3,WEB,0,0,1,2,2,,2,,1,,,3,2,4,2,2,3,4,4,3,2,2,4,2,2,,,,,,,1,2,2,0,2,1,2,1,2,,2,,2,,2,1,,2,2,2,2,2,2,2,2,2,2,2,2,2,2,2,2,2,2,2,2,1,,2,1,2,1,2,2,1,1,1,1,1,1,2,2,2,2,4,3,4,4,4,4,4,4,4,4,2,,5,5,5,5,5,1,2,2
2,1,3,4,2,5,1,5,2,2,1,1,WEB,0,0,1,2,2,,2,,1,,,2,3,2,3,3,2,2,2,2,4,4,2,2,1,1,2,2,,1,2,1,2,1,2,1,1,1,1,1,2,1,2,2,,2,2,2,2,1,2,2,2,2,2,2,2,2,2,2,2,2,2,2,2,2,2,2,,1,2,1,2,3,2,2,3,1,1,3,4,3,1,2,2,2,3,2,3,2,3,3,3,2,4,2,2,,1,3,2,1,3,1,1,2
2,1,3,4,1,6,1,6,1,,1,4,WEB,0,0,1,2,1,,2,,2,,,3,2,4,3,3,3,4,4,1,4,4,4,2,2,,,,,,,2,3,0,1,1,2,1,1,2,,2,,2,,2,1,,2,2,2,2,2,2,2,2,2,2,2,2,2,2,2,2,2,2,2,2,,2,2,1,2,3,2,2,1,1,1,1,2,1,2,2,2,2,4,3,3,4,4,4,3,4,4,4,2,,5,3,5,5,3,1,2,1
2,1,4,4,2,5,1,4,3,2,2,4,WEB,0,0,1,2,2,,1,,1,,,3,2,4,3,3,2,4,4,3,4,4,4,2,1,1,2,2,,2,2,3,2,1,1,0,1,1,2,1,2,1,2,2,,2,5,1,1,1,2,2,2,2,1,1,2,2,1,2,1,2,2,2,2,2,2,1,,2,2,1,2,1,2,2,1,2,2,1,1,1,1,2,2,1,4,3,3,4,4,4,4,4,4,4,2,2,2,3,3,2,3,1,2,1
1,1,4,4,2,6,1,5,2,2,2,2,WEB,0,0,1,2,2,,2,,1,,,3,2,3,2,2,3,4,4,2,4,4,4,2,2,,,,,,,1,2,0,0,0,2,2,2,2,,2,,2,,2,2,2,1,1,2,1,1,2,2,2,2,2,2,2,2,2,2,2,2,2,2,2,2,,2,1,2,1,2,2,1,1,1,1,1,1,1,2,2,1,3,3,4,4,4,4,4,3,3,4,2,,4,4,4,3,4,1,1,1
1,1,4,4,2,5,2,,1,,2,3,PAPER,0,0,1,2,2,,2,,1,,,3,,,,3,3,,,,,,4,2,,,,2,,2,2,1,1,,,0,,,2,,,,,,,2,1,,,,,,,,,,,,,,,,,,,,,,,2,,1,2,1,2,2,1,1,1,1,1,1,2,2,2,,4,3,4,3,4,4,4,3,3,4,2,2,5,5,5,5,5,1,1,2
1,1,4,4,2,6,1,6,2,2,2,3,PAPER,0,0,1,2,2,,2,,1,,,2,2,4,2,3,3,4,4,2,4,4,4,2,2,,,,,,,1,2,0,0,0,2,2,2,2,,2,,2,,2,1,2,2,2,2,1,2,2,1,2,2,2,1,2,2,2,2,2,2,2,2,2,1,,2,1,2,1,2,2,1,1,1,1,1,1,2,2,2,2,3,3,4,4,4,4,3,3,3,4,1,,5,5,2,1,2,1,2,2
1,3,4,4,2,6,1,5,2,2,2,,PAPER,0,0,1,2,2,,2,,1,,,3,2,4,3,2,2,4,4,2,3,4,4,1,2,,,,,,,3,3,1,1,1,1,1,1,2,,2,,2,,2,3,2,1,1,2,2,2,2,1,2,2,2,2,1,2,2,2,2,2,2,2,2,2,,2,2,1,1,2,2,2,1,2,1,1,1,2,2,2,2,3,3,3,3,4,4,4,4,4,3,2,,3,2,4,3,3,1,2,2
1,1,4,4,2,7,1,2,1,,2,3,WEB,0,0,1,2,2,,2,,1,,,2,2,4,2,3,3,4,4,2,4,4,4,2,2,,,,,,,1,1,0,0,0,2,2,2,2,,2,,2,,2,3,1,1,2,2,2,2,2,2,2,2,2,2,2,2,2,2,2,2,2,2,2,1,,2,1,2,1,2,2,1,1,1,1,1,1,2,2,2,2,4,3,3,3,3,4,4,4,3,4,2,,4,4,4,5,4,1,2,2
2,1,4,4,2,4,2,5,2,2,1,3,PAPER,1,0,1,2,2,,,,1,,,2,2,4,2,3,3,4,4,1,4,4,4,2,2,,,,,,,1,2,0,0,0,2,2,2,2,,2,,2,,1,5,1,2,2,2,2,2,2,2,1,2,2,2,2,2,2,2,2,2,2,2,1,,2,2,1,2,3,2,2,1,1,1,1,1,1,2,2,2,2,4,3,4,4,4,4,4,4,4,4,2,,5,4,3,4,3,1,2,2
1,1,4,4,2,5,1,5,2,2,1,3,PAPER,0,0,1,2,2,,2,,1,,,3,3,3,3,3,2,3,3,2,3,3,3,2,2,,,,,,,2,2,1,1,1,1,1,1,1,1,1,1,2,2,2,5,1,2,1,2,2,2,2,2,2,2,2,2,1,1,2,2,2,2,2,2,2,1,,2,1,2,2,2,2,3,2,2,2,3,2,1,1,2,2,3,2,3,3,3,3,2,3,3,3,2,3,1,2,2,1,3,1,2,2
1,1,4,4,2,6,1,4,1,,2,3,PAPER,0,0,1,2,2,,2,,1,,,3,2,4,3,3,2,4,4,3,4,4,4,1,2,,,,,,,1,2,0,0,0,2,2,2,2,,2,,2,,2,2,1,2,2,2,2,2,2,2,2,2,2,2,2,2,2,2,1,2,1,,2,1,,2,1,2,1,2,2,1,1,1,1,1,1,2,2,2,1,4,2,4,4,4,4,4,4,4,4,2,2,5,5,5,5,5,1,2,2
1,1,3,4,2,4,1,5,1,,1,3,WEB,0,0,1,2,2,,2,,1,,,2,2,4,2,3,3,4,4,2,4,4,4,2,2,,,,,,,1,1,0,0,0,2,2,2,2,,2,,2,,2,1,,2,2,2,2,2,2,2,2,2,2,2,2,2,2,2,2,2,2,2,2,2,,2,1,2,2,2,2,1,1,1,1,1,1,2,2,2,2,4,3,3,4,4,4,4,4,4,4,2,,4,4,4,4,4,1,2,2
1,1,4,4,2,5,1,5,1,,2,3,PAPER,0,0,1,2,2,,2,,1,,,2,2,4,2,,,4,4,1,4,4,4,2,2,,,,,,,3,2,0,0,0,2,2,2,2,2,2,2,2,2,2,1,,1,1,2,2,2,1,2,2,2,2,2,2,2,2,2,1,2,2,,2,2,,2,1,2,1,2,2,1,1,1,1,1,1,2,2,1,2,3,2,3,4,4,3,4,4,4,3,2,,5,2,4,5,5,1,2,2
2,3,4,4,2,4,1,1,1,1,2,3,PAPER,0,0,1,2,2,,2,,1,,,3,3,3,2,1,1,3,3,4,2,3,4,2,1,2,2,2,,2,2,3,2,2,0,2,1,2,1,1,1,2,,2,,2,2,1,2,2,2,2,2,2,2,2,2,2,2,2,2,2,2,2,2,2,2,2,,2,2,1,2,3,2,2,1,1,1,1,1,1,2,2,2,1,4,4,4,4,4,4,4,4,4,4,2,,5,5,5,5,5,1,1,2
1,1,3,4,2,6,1,5,1,,1,,PAPER,0,0,1,2,1,,1,,2,,,4,4,2,4,2,2,2,2,4,2,2,3,2,2,,,,,,,2,3,2,2,2,1,1,1,1,2,1,2,1,2,2,5,1,2,1,2,2,2,2,2,2,2,2,2,1,1,2,2,1,2,2,2,2,2,,2,1,2,2,2,1,4,4,4,4,4,4,1,1,2,2,2,2,2,3,3,2,3,2,3,3,1,1,3,3,3,4,1,1,2,2
1,1,3,4,2,4,1,6,1,,1,3,WEB,0,0,1,2,2,,2,,1,,,2,4,2,4,2,2,3,3,3,2,2,4,2,1,1,2,2,,2,2,3,3,0,0,0,2,2,2,1,1,1,1,1,1,2,5,2,2,1,2,2,2,2,2,2,2,2,2,2,2,2,2,2,2,2,1,2,1,,2,1,2,1,2,2,2,2,2,2,1,1,2,2,2,2,4,3,3,4,4,3,4,3,3,4,2,,4,5,5,5,4,1,2,2
1,1,3,4,2,6,1,5,1,,1,3,PAPER,0,0,1,2,2,,2,,1,,,2,2,4,3,3,3,4,4,2,4,4,4,2,2,,,,,,,1,1,0,0,0,2,2,2,2,2,2,2,2,2,2,2,2,2,2,2,2,2,2,2,2,2,2,2,2,2,2,2,2,2,1,2,2,2,,2,1,2,3,2,2,1,1,1,1,1,1,2,1,1,2,4,3,3,3,4,4,3,3,3,3,2,,5,5,5,5,5,1,1,1
1,1,3,4,2,6,1,6,2,2,1,3,WEB,0,0,1,2,2,,1,,1,,,2,4,3,2,3,3,3,3,1,4,4,3,1,1,1,2,2,,1,2,1,1,1,1,1,1,1,1,2,,2,,2,,2,5,1,1,1,2,2,2,2,1,2,2,2,2,1,1,2,2,2,2,2,1,2,1,,2,1,2,1,2,2,2,2,2,2,2,2,1,2,2,2,4,3,3,3,4,4,4,3,4,4,1,2,1,2,2,1,3,1,2,2
1,1,4,4,2,7,1,6,1,,2,3,PAPER,0,0,1,2,2,,1,,1,,,3,2,4,2,2,2,4,4,2,3,3,4,1,1,2,2,2,1,2,2,1,1,1,1,1,1,1,1,1,1,1,1,2,,1,5,1,2,2,2,2,2,2,2,2,2,2,2,1,1,2,2,1,2,1,2,,1,,,1,2,1,2,2,1,1,1,1,1,1,2,2,1,2,4,4,4,4,4,4,4,4,4,4,2,2,5,5,5,5,5,1,1,2
2,1,4,4,1,7,1,4,3,2,1,2,PAPER,0,0,1,2,1,,1,,2,,,4,4,2,4,3,1,2,3,2,3,4,2,2,2,,,,,,,1,2,2,2,0,1,1,2,1,2,2,2,2,2,2,4,1,1,1,2,2,2,2,2,2,2,2,1,2,2,1,2,2,2,2,,1,,1,2,1,2,1,2,1,,4,4,4,4,4,1,2,2,2,3,3,3,3,3,3,3,3,3,3,2,,1,2,1,1,2,1,2,2
1,1,4,4,2,6,1,4,1,,2,4,PAPER,0,0,1,2,2,,2,,1,,,3,3,4,2,3,3,4,4,1,4,4,4,2,2,,,,,,,1,2,0,,0,2,,2,1,1,2,,2,,2,5,1,1,1,2,2,2,2,2,2,2,2,2,1,1,2,2,1,2,2,1,2,2,,2,1,2,1,2,2,1,1,1,1,1,1,2,2,2,2,4,3,4,4,4,4,3,3,3,3,1,2,5,5,5,5,5,1,1,2
1,1,4,4,2,5,1,4,1,,2,4,WEB,0,0,1,2,2,,2,,1,,,3,2,4,3,2,2,4,4,3,3,3,4,2,2,,,,,,,1,3,2,0,1,1,2,1,1,2,2,,2,,2,5,2,1,1,2,2,2,2,2,2,2,2,1,2,1,1,2,1,2,1,2,2,1,,2,1,2,1,1,2,1,1,2,1,2,1,2,2,2,1,4,2,3,4,4,4,4,4,3,4,1,,5,5,5,5,5,1,2,2
1,1,4,4,2,6,1,4,1,,1,4,WEB,0,0,1,2,2,,2,,1,,,4,2,3,4,3,2,4,4,1,4,4,4,1,2,,,,,,,1,3,0,0,0,2,2,2,2,,2,,2,,2,2,2,1,1,2,2,2,2,2,2,2,2,2,1,2,2,2,1,2,2,2,2,1,,2,1,2,1,2,2,1,1,1,1,1,1,1,2,2,2,3,2,3,3,3,3,2,3,3,3,1,,5,5,5,5,5,1,2,2
2,3,4,4,2,7,1,1,3,2,1,4,WEB,0,0,1,2,2,,2,,1,,,2,3,3,3,3,3,3,4,2,4,4,4,2,2,,,,,,,3,2,0,1,1,2,1,1,2,,2,,2,,2,1,,1,1,2,2,2,2,2,2,2,2,2,2,2,2,2,2,1,2,2,2,,1,2,1,2,1,2,2,1,1,2,2,2,1,2,2,2,2,4,3,3,4,4,4,4,3,4,4,1,,2,3,2,1,3,1,1,2
1,1,4,4,2,6,1,1,2,2,1,3,WEB,0,0,1,2,2,,2,,1,,,4,3,4,4,1,1,3,4,4,2,2,2,1,2,,,,,,,3,3,2,1,1,1,1,1,1,1,2,,1,1,1,1,,1,2,2,1,1,2,2,2,1,2,2,2,2,2,2,1,1,1,2,1,2,,2,1,2,1,1,2,1,2,1,1,2,1,2,2,2,1,3,2,2,3,3,3,3,3,3,3,1,,2,4,2,2,1,1,2,1
1,4,4,4,2,7,1,6,1,,2,,WEB,0,0,1,2,2,,2,,1,,,2,,,,3,3,4,4,1,4,,,,,,,,,,,,,,,,,,,,,,,,,,,,,,,,,,,,,,,,,,,,,,,,,,,,,,,,,,,,,,,,,,,,,,,,,,,,,,,,,,,,,
2,1,4,4,2,6,1,4,1,,2,2,WEB,0,0,1,2,2,,2,,1,,,2,2,4,2,3,3,4,4,2,4,4,4,2,1,2,2,2,,2,,2,2,0,1,0,2,1,2,2,,2,,2,,2,1,,1,1,2,2,2,2,2,2,2,2,2,2,2,1,2,2,2,1,1,2,,2,1,1,2,1,2,2,2,1,2,1,1,2,2,2,1,2,3,3,4,3,3,3,3,3,3,3,2,,5,3,3,4,3,1,2,1
1,1,4,4,2,5,1,3,1,,2,2,PAPER,0,0,1,2,2,,2,,1,,,2,2,4,2,3,3,4,,2,4,4,4,2,2,,,2,,2,2,1,2,0,0,0,2,2,2,2,,2,,2,,2,1,,1,1,2,2,2,1,2,2,2,2,2,2,2,1,2,2,2,2,2,2,1,,2,1,2,1,2,2,1,1,1,1,1,1,2,2,2,2,3,2,3,3,3,3,2,3,3,3,3,,5,2,2,4,3,2,2,2
2,1,4,4,2,4,2,,2,2,2,1,PAPER,0,0,1,2,2,,2,,1,,,4,3,3,4,1,1,2,2,4,2,2,3,1,1,1,1,1,1,1,1,1,4,2,2,2,1,1,1,1,,2,,2,,2,1,,1,2,2,1,2,2,2,2,,2,2,2,2,1,2,2,2,1,,2,,2,2,1,2,1,1,2,,,,,,,1,2,2,1,,,,,,,,,,,2,,5,,,5,,1,2,2
2,1,4,4,2,6,1,5,1,,1,2,WEB,0,0,1,2,2,,2,,1,,,1,2,4,2,3,3,4,4,1,4,4,4,2,2,,,,,,,3,1,0,0,0,2,2,2,2,,2,,2,,2,1,,1,2,2,2,2,2,2,2,1,2,2,2,2,2,2,2,2,2,2,2,,2,2,1,2,3,2,2,1,1,1,1,1,1,2,2,2,2,4,4,4,4,4,4,4,4,4,4,2,,5,5,5,5,5,1,1,1
2,1,4,4,2,5,2,2,1,,2,1,PAPER,0,0,1,2,2,,2,,1,,,,3,3,4,1,1,3,3,1,2,2,3,2,1,2,2,2,1,2,2,1,2,2,1,2,1,1,1,1,2,1,2,2,2,1,3,1,,,,,,,,,1,,,,1,,,,,,,1,,1,2,1,2,1,2,2,2,1,,,4,3,2,2,2,2,3,,3,3,,3,3,,,3,2,2,4,3,4,,4,1,2,2
1,1,4,4,2,5,1,4,1,,2,4,WEB,0,0,1,1,2,,1,,1,,,3,3,4,4,1,1,3,3,4,2,2,4,1,2,,,,,,,1,3,2,1,2,1,1,1,1,2,2,,2,,2,4,1,1,1,2,2,2,2,2,2,2,2,2,1,2,2,2,2,2,1,2,2,2,,2,1,2,1,2,2,2,1,2,1,1,1,2,2,2,2,3,2,3,2,3,3,3,3,3,3,3,,4,5,5,5,4,2,2,2
1,1,4,4,2,6,2,4,1,,2,3,PAPER,0,0,1,2,2,,2,,1,,,2,2,4,2,3,2,4,4,2,3,4,4,1,2,,,,,,,1,2,0,0,0,2,2,2,1,2,1,2,2,,2,2,1,1,2,2,1,2,2,2,2,2,2,1,2,1,2,2,1,1,2,2,2,2,,2,1,2,1,2,2,1,1,1,1,1,1,2,2,2,1,4,2,3,4,4,4,4,4,4,4,2,,5,5,5,5,5,1,1,1
1,4,4,4,2,6,1,5,1,,2,3,PAPER,0,0,1,2,2,,1,,1,,,2,2,4,3,3,2,4,4,3,3,3,3,2,1,1,1,2,,2,2,1,2,0,1,1,2,1,1,2,,1,1,1,2,1,2,1,1,1,2,2,2,2,1,1,1,2,1,1,1,2,1,2,2,1,2,1,2,,2,1,2,2,1,1,1,2,2,1,1,1,2,2,1,2,3,2,3,3,3,3,3,3,3,3,2,,5,4,4,4,2,1,2,1
1,1,4,4,2,5,1,5,1,,2,4,WEB,0,0,1,2,2,,1,,1,,,3,3,3,2,2,2,3,3,3,3,3,3,2,1,2,2,2,,1,1,1,2,1,1,1,1,1,1,1,1,2,,1,1,1,2,2,1,1,2,2,2,2,2,2,2,2,2,2,2,2,2,2,2,1,1,1,1,,2,1,2,1,2,1,2,1,3,1,3,1,2,1,1,1,4,3,3,4,4,4,4,4,4,4,1,3,3,2,3,2,3,1,1,2
1,1,4,4,2,7,2,5,1,,2,4,PAPER,0,0,1,2,2,,2,,1,,,4,2,4,4,1,1,4,4,4,2,2,4,2,1,1,1,2,,2,2,1,3,2,0,0,1,2,2,1,1,1,2,1,2,2,1,,1,1,2,2,2,2,1,1,1,2,2,1,2,2,2,1,2,2,2,2,2,,2,1,2,2,1,2,1,1,2,1,2,1,2,2,2,1,3,2,2,3,3,3,3,3,3,2,1,2,4,3,3,4,3,1,2,1
1,1,4,4,2,5,1,,1,,2,,PAPER,0,0,1,2,1,,1,,1,,,3,2,4,2,2,2,2,3,2,3,3,4,2,2,2,2,2,,2,2,1,2,0,0,,2,2,,1,2,2,,2,,2,,1,1,1,2,2,,2,1,2,2,2,2,2,1,2,2,1,2,2,,2,2,,2,1,2,1,2,2,1,1,1,1,1,1,2,2,2,2,4,3,4,4,4,4,4,4,4,4,2,2,5,5,5,5,5,1,2,2
1,1,4,4,2,7,2,3,2,1,2,3,WEB,0,0,1,2,2,,2,,1,,,3,2,4,4,2,2,4,4,3,2,3,3,2,2,,,,,,,1,2,1,0,1,1,2,1,2,,2,,2,,2,3,2,1,1,2,2,2,2,2,2,2,2,2,2,1,1,2,1,2,1,2,2,2,,2,1,2,2,2,2,1,2,2,1,1,1,2,2,2,1,3,3,3,3,3,4,4,4,4,3,2,,5,5,5,5,4,1,2,2
1,1,4,4,2,7,1,6,1,,1,4,WEB,0,0,1,2,2,,2,,1,,,2,2,4,2,3,2,4,4,1,4,4,4,2,1,1,2,2,,2,1,1,2,0,0,0,2,2,2,2,,2,,2,,,1,,1,1,2,2,2,2,2,2,2,2,2,1,2,2,2,1,2,2,2,2,2,,2,1,2,1,2,2,1,1,1,1,1,1,2,2,2,2,4,3,4,4,3,4,3,4,4,4,2,,5,5,5,5,5,1,1,1
1,1,3,4,2,5,1,5,1,,1,3,WEB,0,0,1,2,2,,2,,1,,,2,3,3,3,3,2,4,4,4,3,3,4,1,1,2,2,2,,2,2,1,2,1,1,1,1,1,1,2,,2,,2,,2,4,1,1,1,2,2,2,2,2,2,2,2,2,2,2,2,2,2,2,2,2,2,1,,2,1,2,1,2,2,1,1,1,1,2,1,1,2,2,2,3,3,3,3,3,4,4,4,3,3,2,,4,4,5,5,5,1,2,2
1,1,3,4,2,6,1,3,1,,1,2,WEB,0,0,1,1,2,,1,,1,,,2,2,4,2,3,3,4,4,2,3,3,4,2,2,,,,,,,1,2,1,1,1,1,1,1,2,,2,,2,,2,5,1,2,2,2,2,2,2,2,2,2,2,2,2,2,2,2,2,2,2,2,2,1,,2,1,2,2,2,2,1,1,1,1,1,1,2,2,2,2,3,2,4,4,4,3,4,3,3,3,2,,5,5,5,5,5,1,2,2
2,1,4,4,2,6,1,1,2,2,2,3,WEB,0,0,1,2,,,2,,1,,,3,2,3,4,2,1,2,3,4,2,2,2,2,1,1,2,1,1,1,1,3,3,0,1,0,2,1,2,1,2,2,,2,,2,4,1,1,1,2,1,1,2,2,2,2,2,2,2,2,2,2,2,2,2,2,2,,1,2,1,2,1,2,2,1,2,2,1,2,2,1,2,1,2,4,3,3,4,4,4,4,4,4,4,2,,5,3,3,4,5,1,2,1
1,3,4,4,2,6,1,5,1,,2,2,WEB,0,0,1,2,2,,2,,1,,,3,3,3,3,2,2,3,3,3,3,3,3,2,2,,,,,,,3,2,2,2,2,1,1,1,1,2,2,,1,2,1,1,,,1,,,,,,,1,,,,,,,,,,2,2,2,,2,1,2,2,2,1,3,3,3,2,3,2,1,1,1,2,3,3,3,4,4,4,4,4,4,4,2,2,1,3,4,4,4,1,2,2
1,1,4,4,2,6,1,6,1,,2,2,WEB,0,0,1,2,1,,2,,2,,,2,2,4,2,3,3,4,4,1,4,4,4,2,2,,,,,,,1,2,0,1,0,2,1,2,2,,2,,2,,2,1,,1,2,2,2,2,2,2,2,2,2,2,2,2,2,2,2,2,2,2,2,1,,2,1,2,2,2,2,1,1,1,1,1,1,2,2,2,2,3,3,3,4,4,3,4,4,4,4,2,,5,5,5,5,5,1,2,1
1,1,4,4,2,6,1,5,1,,2,3,WEB,0,0,1,2,2,,2,,1,,,3,2,4,3,2,2,4,4,3,3,3,4,2,2,,,,,,,1,3,1,0,1,1,2,1,1,2,1,2,2,,2,4,1,1,1,2,2,2,2,2,2,2,2,1,1,1,2,2,1,2,2,2,2,1,,2,1,2,1,2,2,1,1,1,1,1,1,2,2,2,2,4,4,4,4,4,4,4,4,4,4,2,,5,5,5,5,5,1,2,2
2,4,4,4,2,6,1,2,2,2,2,4,PAPER,0,0,1,2,2,,2,,1,,,2,3,4,3,1,3,3,4,1,4,4,4,2,1,,,,2,2,2,1,3,0,0,0,2,2,2,2,2,2,2,2,2,2,1,,1,1,2,2,2,2,1,2,2,2,2,2,2,2,2,2,2,2,2,2,,1,2,1,2,1,2,2,1,1,1,1,1,1,2,2,2,2,3,2,3,3,3,3,3,3,3,3,2,2,1,1,1,1,1,1,2,2
1,1,3,4,2,5,1,5,2,2,1,4,WEB,0,0,1,2,2,,2,,1,,,4,4,3,4,2,2,3,3,4,2,2,3,1,1,1,2,2,,2,2,1,2,2,2,2,1,1,1,2,,2,,2,,2,2,2,2,1,2,2,2,2,2,2,2,2,2,1,2,2,2,2,2,2,2,1,2,,2,1,2,1,2,2,1,1,1,2,2,2,1,2,2,2,4,3,3,3,3,4,3,3,3,3,2,,3,3,2,3,3,1,1,2
1,4,4,4,2,6,1,6,1,,2,4,WEB,0,0,1,2,2,,2,,1,,,4,3,3,4,1,2,3,3,4,3,3,3,1,1,2,2,2,,2,1,1,2,1,1,1,1,1,1,1,1,2,,1,1,1,5,1,1,1,2,2,2,2,2,1,2,2,1,1,1,2,1,1,1,1,1,1,1,,2,1,2,1,2,2,1,2,1,1,1,1,1,1,2,1,4,3,4,4,4,4,4,4,4,4,2,2,5,5,5,5,5,1,1,2