new_education,new_employed_911,census_new,income_new,boroughcode,age_911grp,gender,curr_employment,mar_911_new,mar_new,resident_e,worker_e,occ_trans_e,s_s,all_enrl,any_injury,count_events,femarating,new_work_pile,new_work_siland_barge,smkstatus,dust_cat,m1_leave_f1,m1_notnec_f1,m1_stay_f1,m1_nowhere_f1,other_leave,damage_condition,dust_condition,new_clean,m1_epa_f1,type_911,type_912,type_0101,training,m3_fittest_f1,cough_30d_f1,cough_freq_f1,cough_cons_f1,depression_f1,anxiety_f1,headache_30d_f1,hear_30d_f1,htburn_30d_f1,brthless_30d_f1,skinrash_30d_f1,throat_30d_f1,wheeze_30d_f1,hoarse_30d_f1,asthma_f1,asthma_12m_f1,inhaler_asth_f1,hypertension_f1,heart_attack_f1,other_heart_f1,stroke_f1,rads_f1,sarcoidosis_f1,diabetes_f1,cancer_f1,emphysema_f1,prob_distress13_f1,ptsddx_n44_f1,sinus_30d_f1
4,1,3,3,No,25-44,2,Yes,1,1,No,Yes,No,2,1,No,0,VALID MISSING,2,,3,1,,,,,2,,,,,,,,,,2,,,1,1,1,2,2,2,2,2,2,2,1,1,1,1,2,1,2,2,2,2,2,2,2,Yes,1
5,1,3,2,Yes,45-64,2,Yes,4,4,No,No,Yes,2,1,Yes,1,Not in damage or destroyed building,,,1,1,,,,,2,,,,,,,,,,,,,2,2,2,2,2,2,2,2,2,1,2,,,2,2,2,2,2,2,2,2,2,2,,1
6,1,1,4,No,45-64,1,Yes,4,4,No,Yes,No,2,1,No,0,VALID MISSING,,1,1,1,,,,,2,,,,,4,1,4,1,1,2,,,2,2,2,2,2,2,2,2,2,2,2,,,1,2,1,2,2,2,2,2,2,2,No,2
6,1,2,2,Yes,65+,2,Yes,3,3,No,Yes,No,2,1,No,0,VALID MISSING,2,,1,1,,,,,2,,,,,,,,,,2,,,2,2,2,2,2,2,2,2,2,2,2,,,1,2,2,2,2,2,2,2,2,2,No,2
6,1,2,3,No,45-64,1,Yes,2,4,No,Yes,No,2,1,No,0,VALID MISSING,,1,3,1,,,,,2,,,,,4,,,2,3,2,,,2,2,2,1,2,1,2,2,2,2,2,,,1,2,2,2,2,2,2,2,2,2,No,2
5,1,1,2,No,45-64,2,No,1,1,No,Yes,No,2,1,No,0,VALID MISSING,2,,3,1,,,,,2,,,,,,,,,,1,1,1,1,2,1,2,2,2,2,2,2,2,1,2,1,1,2,1,1,2,2,1,2,2,2,No,1
6,1,1,4,No,45-64,1,Yes,1,1,No,Yes,No,2,1,No,0,VALID MISSING,1,,3,1,,,,,2,,,,,,1,,1,1,2,,,2,2,2,2,2,2,2,2,2,2,2,,,1,2,2,2,2,2,2,2,2,2,No,2
6,1,2,4,No,25-44,1,Yes,5,2,No,Yes,No,2,1,No,0,VALID MISSING,2,,1,1,,,,,2,,,,,,,,,,2,,,2,2,1,1,2,1,2,2,2,2,2,,,2,2,2,2,2,2,2,2,2,2,No,1
5,1,1,3,No,45-64,2,Yes,1,1,No,Yes,No,2,1,No,0,VALID MISSING,2,,3,1,,,,,2,,,,,,,,,,2,,,2,2,1,2,2,2,2,1,2,1,2,,,1,1,2,2,2,2,2,2,2,2,Yes,1
6,1,3,,No,45-64,1,Yes,4,4,No,Yes,No,2,1,No,0,VALID MISSING,2,,2,1,,,,,2,,,,,4,4,4,2,,1,1,2,1,1,2,2,1,1,2,2,2,2,2,,,1,2,1,2,2,2,2,2,2,1,No,1
6,1,1,2,No,25-44,2,Yes,1,1,No,Yes,No,2,1,No,0,VALID MISSING,2,1,2,1,,,,,2,,,,,,,,2,3,2,,,2,2,2,1,2,2,2,2,2,2,2,,,2,2,2,2,2,2,2,2,2,2,Yes,2
5,1,1,4,No,45-64,1,Yes,4,4,No,Yes,No,2,1,No,0,VALID MISSING,1,,1,1,,,,,2,,,,,,2,,2,,2,,,2,2,1,2,1,1,2,1,1,2,2,,,2,2,2,2,2,2,2,2,2,2,No,1
5,1,1,4,No,45-64,1,Yes,4,1,No,Yes,No,2,1,No,0,VALID MISSING,2,,3,1,,,,,2,,,,,,,,,,1,1,1,2,2,2,2,2,2,2,2,2,2,2,,,1,2,2,2,2,2,2,2,2,2,No,2
5,1,1,4,No,25-44,2,Yes,,4,No,Yes,No,2,1,No,0,VALID MISSING,1,1,1,1,,,,,2,,,,,,2,,2,2,2,2,2,2,2,2,2,1,1,1,1,2,2,2,,,2,2,2,2,2,2,2,2,2,2,No,1
7,1,1,3,No,45-64,1,Yes,1,1,No,Yes,No,2,1,No,0,VALID MISSING,1,,1,1,,,,,2,,,,,2,2,2,1,,2,,,2,2,2,2,2,2,2,2,1,2,1,2,2,2,2,2,2,2,2,2,2,2,2,No,1
4,2,1,,No,45-64,2,Yes,1,1,No,Yes,No,2,1,No,0,VALID MISSING,2,,2,1,,,,,2,,,,,,,,,,2,,,2,2,2,2,1,1,2,2,2,2,2,,,1,2,2,2,2,2,2,2,2,2,No,1
4,2,1,2,No,65+,1,Yes,1,1,No,Yes,No,2,1,No,0,VALID MISSING,2,,2,1,,,,,2,,,,,,,,,,2,,,2,2,2,2,2,2,2,2,2,2,2,,,2,2,2,2,2,2,2,1,2,2,No,2
5,1,1,4,No,45-64,1,Yes,4,1,No,Yes,No,2,1,No,0,VALID MISSING,1,,2,1,,,,,2,,,,,4,4,4,2,3,1,2,1,2,2,2,2,2,2,2,1,2,2,2,,,1,2,2,2,2,2,2,2,2,2,No,1
5,1,1,4,No,45-64,1,Yes,1,1,No,Yes,No,2,1,No,0,VALID MISSING,2,,2,1,,,,,2,,,,,,,,,,2,,,2,2,2,2,2,2,2,2,1,2,1,1,1,2,2,1,2,2,2,2,2,2,2,No,1
7,1,1,4,No,45-64,1,No,4,2,No,Yes,No,2,1,No,0,VALID MISSING,2,1,1,1,,,,,2,,,,,,,,1,,2,2,2,2,2,2,2,2,2,2,2,2,2,2,,,2,2,2,2,2,2,2,1,2,2,No,2
6,2,1,1,Yes,45-64,1,No,1,1,No,Yes,No,2,1,No,0,VALID MISSING,1,,2,1,,,,,2,,,,,4,4,4,1,,2,,,1,1,2,2,2,2,2,2,2,2,2,,,1,2,1,2,2,2,2,2,2,2,No,1
4,1,1,4,No,45-64,1,Yes,1,1,No,Yes,No,2,1,No,0,VALID MISSING,2,,2,1,,,,,2,,,,,,,,,,2,,,2,2,2,,2,2,2,2,2,2,2,,,2,2,2,2,2,2,2,2,2,2,No,2
6,1,1,4,No,45-64,1,Yes,1,1,No,Yes,No,2,1,No,0,VALID MISSING,1,1,1,1,,,,,2,,,,,4,,,1,,,,,2,2,2,2,1,2,2,2,2,2,2,,,1,2,2,2,2,2,2,2,2,2,No,2
6,2,5,4,No,45-64,1,Yes,1,1,No,Yes,No,2,1,No,0,VALID MISSING,2,,1,1,,,,,2,,,,,,,,,,1,1,1,1,2,2,1,1,1,2,2,2,2,2,,,1,2,1,2,2,2,2,2,2,1,Yes,1
6,2,1,1,No,45-64,1,No,1,1,No,Yes,No,2,1,No,0,VALID MISSING,2,,2,1,,,,,2,,,,,,,,,,2,,,2,2,2,1,1,2,1,2,2,2,2,,,1,2,1,2,2,2,1,1,2,2,No,1
6,1,1,3,No,45-64,1,Yes,1,1,No,Yes,No,2,1,No,0,VALID MISSING,2,,1,1,,,,,2,,,,,,,,,,1,2,1,2,2,1,1,1,1,2,2,1,2,2,,,1,2,2,2,2,2,1,2,2,2,,2
6,1,1,2,No,45-64,2,Yes,4,4,No,Yes,No,2,1,No,0,VALID MISSING,2,,2,1,,,,,2,,,,,,,,,,2,,,2,2,1,1,2,2,2,2,2,2,2,,,2,2,2,2,2,2,2,2,2,2,No,2
6,1,2,2,No,65+,2,Yes,1,1,No,Yes,No,2,1,No,0,VALID MISSING,2,,3,1,,,,,2,,,,,,,,,,1,1,2,2,2,1,2,2,2,1,1,1,1,1,2,2,1,2,2,2,2,2,2,2,2,2,No,1
6,1,1,,No,25-44,1,,,,No,Yes,No,2,1,No,0,VALID MISSING,2,,1,1,,,,,2,,,,,,,,,,2,,,2,2,2,2,2,2,2,2,2,2,2,,,2,2,2,2,2,2,2,2,2,2,No,2
5,2,1,2,No,65+,1,Yes,1,1,No,Yes,No,2,1,No,0,VALID MISSING,2,,3,1,,,,,2,,,,,,,,,,1,1,1,2,2,2,1,2,2,2,2,2,2,2,,,2,2,2,2,2,2,1,2,2,2,No,1
5,1,3,4,No,65+,1,Yes,1,1,No,Yes,No,2,1,No,0,VALID MISSING,2,,1,1,,,,,2,,,,,,,,,,2,,,2,2,2,1,1,1,2,1,2,2,2,,,1,2,2,2,2,2,2,2,2,2,No,1
7,1,1,4,No,25-44,2,Yes,1,1,No,Yes,No,2,1,No,0,VALID MISSING,2,,1,1,,,,,2,,,,,,,,,,1,1,1,1,2,2,2,1,2,2,1,2,2,2,,,1,2,2,2,2,2,2,2,2,1,Yes,2
5,1,1,3,No,45-64,1,Yes,1,1,No,Yes,No,2,1,No,0,VALID MISSING,2,,2,1,,,,,2,,,,,,,,,,2,,,2,2,2,1,2,1,2,1,2,1,2,,,2,2,2,2,2,2,2,2,2,2,No,1
5,1,3,3,Yes,45-64,2,Yes,5,2,No,Yes,Yes,2,1,No,0,VALID MISSING,2,,2,1,,,,,2,,,,,,,,,,2,,,1,2,1,2,1,1,2,1,1,2,1,1,1,1,2,2,2,2,2,2,2,2,2,Yes,1
6,1,1,,No,25-44,2,Yes,1,1,No,Yes,No,2,1,No,0,VALID MISSING,2,,2,1,,,,,2,,,,,,,,,,2,,,2,2,2,1,2,1,2,2,2,2,2,,,2,2,2,2,2,2,2,2,2,2,No,2
7,1,1,4,No,25-44,1,Yes,1,4,No,Yes,No,2,1,No,0,VALID MISSING,1,,3,1,,,,,2,,,,,4,,,2,,1,1,1,2,2,2,2,1,2,1,1,1,1,2,,,1,2,2,2,2,2,2,2,2,2,No,1
5,2,3,4,Yes,65+,1,Yes,1,1,No,Yes,No,2,1,No,0,VALID MISSING,2,,2,1,,,,,2,,,,,,,,,,2,,,2,2,2,1,2,2,2,2,2,2,2,,,2,2,2,2,2,2,2,2,2,2,No,1
6,1,1,,No,45-64,1,Yes,1,1,No,Yes,No,2,1,No,0,VALID MISSING,1,1,1,1,,,,,2,,,,,2,2,2,1,,2,,,2,2,1,2,2,1,2,2,2,2,1,2,1,1,2,2,2,2,2,2,2,2,2,No,1
7,1,5,4,No,25-44,1,Yes,1,1,No,Yes,No,2,1,No,0,VALID MISSING,1,1,1,1,,,,,2,,,,,,2,1,2,1,2,,,1,2,2,2,2,2,2,2,2,2,2,,,2,2,2,2,2,2,2,2,2,2,No,1
7,1,1,3,No,25-44,2,Yes,4,4,No,Yes,No,2,1,No,0,VALID MISSING,1,,2,1,,,,,2,,,,,1,1,4,1,1,,,,2,2,2,2,2,2,2,2,2,2,2,,,2,2,2,2,2,2,2,2,2,2,No,2
5,1,1,2,No,45-64,2,Yes,4,4,No,Yes,No,2,1,No,0,VALID MISSING,2,,2,1,,,,,2,,,,,,,,,,2,,,1,2,1,2,2,2,1,2,2,2,2,,,1,2,2,2,2,2,2,2,2,2,No,2
6,1,2,3,Yes,45-64,1,Yes,1,3,No,Yes,No,2,1,No,0,VALID MISSING,2,,1,1,,,,,2,,,,,,,,,,2,,,2,2,1,2,2,2,1,2,1,2,2,,,1,2,2,2,2,2,1,2,2,2,No,1
6,1,1,2,No,45-64,2,Yes,2,5,No,Yes,No,2,1,No,0,VALID MISSING,2,,3,1,,,,,2,,,,,,,,,,1,1,2,2,2,2,2,2,2,2,2,2,1,2,,,2,2,2,2,2,2,2,1,2,2,No,2
6,1,1,4,No,45-64,1,Yes,1,1,No,Yes,No,2,1,Yes,0,VALID MISSING,1,,3,1,,,,,2,,,,,1,2,,1,1,2,,,2,2,2,2,2,2,2,2,2,2,2,,,2,2,2,2,2,2,2,2,2,2,No,2
5,1,1,2,No,65+,1,No,1,1,No,Yes,No,2,1,No,0,VALID MISSING,2,,2,1,,,,,2,,,,,,,,,,2,,,2,2,2,1,2,1,2,2,1,2,2,,,1,2,2,2,2,2,2,1,2,2,No,2
7,1,1,4,No,45-64,1,Yes,5,5,No,Yes,No,2,1,No,0,VALID MISSING,1,,1,1,,,,,2,,,,,,1,1,1,1,2,,,2,2,2,2,1,2,2,2,2,2,2,,,2,2,2,2,2,2,2,2,2,2,No,1
7,1,1,4,Yes,25-44,1,Yes,1,1,No,Yes,Yes,2,1,Yes,5,Not in damage or destroyed building,1,1,1,3,,,,,2,,,,,4,4,4,2,,1,2,1,1,2,2,1,1,1,1,1,1,2,2,,,2,2,2,2,2,2,2,2,2,2,Yes,1
7,1,2,4,No,45-64,1,Yes,1,1,No,Yes,No,2,1,No,0,VALID MISSING,2,,1,1,,,,,2,,,,,,,,,,2,,,2,2,2,2,1,2,2,2,2,2,2,,,2,2,2,2,2,2,2,2,2,2,No,2
6,1,1,3,No,25-44,1,Yes,5,5,No,Yes,No,2,1,No,0,VALID MISSING,1,,1,1,,,,,2,,,,,,2,,2,2,2,,,2,2,2,2,2,2,2,2,2,2,2,,,2,2,2,2,2,2,2,2,2,2,No,1
6,1,2,,No,25-44,2,Yes,1,1,No,Yes,No,2,1,No,0,VALID MISSING,2,,1,1,,,,,2,,,,,,,,,,2,,,2,2,1,2,2,1,2,2,1,2,1,2,1,1,1,1,2,2,2,2,2,2,2,Yes,1
4,1,2,2,No,25-44,2,Yes,,5,No,Yes,No,2,1,No,0,VALID MISSING,2,,1,1,,,,,2,,,,,,,,,,1,1,1,2,2,1,2,2,1,2,1,2,2,2,,,2,2,2,2,2,2,2,2,2,2,No,1
6,1,1,4,No,45-64,1,No,1,1,No,Yes,No,2,1,No,0,VALID MISSING,1,,2,1,,,,,2,,,,,,4,,2,,1,1,1,1,2,2,2,1,1,2,1,1,1,1,1,1,2,2,2,2,1,2,2,2,2,2,No,1
7,2,1,,No,65+,1,Yes,1,1,No,Yes,No,2,1,No,0,VALID MISSING,2,,2,1,,,,,2,,,,,,,,,,2,2,2,2,2,2,2,2,2,2,2,2,2,2,,,1,2,2,2,2,2,2,2,2,2,No,2
7,2,1,3,No,45-64,1,,,,No,Yes,No,2,1,No,0,VALID MISSING,2,,1,1,,,,,2,,,,,,,,,,1,1,1,2,2,1,2,1,2,2,2,2,2,2,,,1,2,2,2,2,2,1,2,2,,No,2
4,1,1,4,No,25-44,1,Yes,1,4,No,Yes,No,2,1,No,0,VALID MISSING,2,,1,1,,,,,2,,,,,,,,,,,,,2,2,2,2,2,2,2,2,2,2,1,2,2,2,2,2,2,2,2,2,2,2,2,No,2
5,1,1,3,No,45-64,1,No,1,1,No,Yes,No,2,1,No,2,VALID MISSING,2,,1,1,,,,,2,,,,,,,,,,2,2,2,2,2,2,2,2,2,2,2,2,2,2,,,1,1,2,2,2,2,1,2,2,2,No,2
7,1,1,2,No,65+,2,No,4,4,No,Yes,No,2,1,No,0,VALID MISSING,2,,2,1,,,,,2,,,,,,,,,,2,2,2,,,2,1,2,2,2,2,2,2,2,2,2,,,,,,,,,,2,Yes,2
5,1,1,3,No,45-64,1,Yes,1,1,No,Yes,No,2,1,No,0,VALID MISSING,2,,1,1,,,,,2,,,,,,,,,,2,,,2,2,1,2,2,2,2,2,2,2,2,,,2,2,2,2,2,2,1,2,2,2,No,2
7,1,3,1,No,45-64,1,Yes,1,4,No,Yes,No,2,1,Yes,5,VALID MISSING,1,,3,1,,,,,2,,,,,4,4,4,2,2,1,1,1,1,1,1,1,1,1,1,1,1,1,1,1,1,1,1,1,2,1,,2,2,2,1,Yes,1
6,1,1,4,No,25-44,1,Yes,2,1,No,Yes,No,2,1,No,0,VALID MISSING,1,,1,1,,,,,2,,,,,,1,,2,2,2,1,1,2,2,2,2,2,2,1,2,2,2,1,2,2,2,2,2,2,2,2,2,2,2,2,No,1
7,2,1,3,No,65+,1,No,1,1,No,Yes,No,2,1,No,0,VALID MISSING,2,,2,1,,,,,2,,,,,,,,,,2,2,2,2,2,2,2,2,2,2,2,2,2,2,,,1,1,2,1,2,2,2,2,2,2,No,2
5,1,1,2,No,65+,1,Yes,1,1,No,Yes,No,2,1,No,0,VALID MISSING,2,,1,1,,,,,2,,,,,,,,,,2,,,1,2,1,1,1,1,1,1,2,1,2,,,1,1,1,2,2,2,2,2,2,2,No,1
4,1,1,3,No,45-64,2,Yes,1,1,No,Yes,No,2,1,No,0,VALID MISSING,2,,1,1,,,,,2,,,,,,,,,,2,,,1,1,1,2,1,2,2,2,2,2,1,1,2,1,2,2,2,2,2,2,2,2,2,No,1
4,1,1,2,No,45-64,2,Yes,1,1,No,Yes,Yes,2,1,No,1,Not in damage or destroyed building,2,,1,1,,,,,2,,,,,,,,,,1,1,1,2,2,2,2,2,1,2,1,1,2,1,1,1,2,2,2,2,2,2,2,2,2,2,No,1
4,1,1,4,No,65+,1,Yes,1,1,No,Yes,No,2,1,No,0,VALID MISSING,2,,2,1,,,,,2,,,,,,,,,,2,,,2,2,2,2,2,2,2,2,2,2,2,,,1,2,2,2,2,2,2,1,2,2,No,2
5,1,3,2,No,65+,1,Yes,4,1,No,Yes,No,2,1,No,0,VALID MISSING,2,,2,1,,,,,2,,,,,,,,,,2,,,2,2,2,2,2,2,2,2,2,2,2,,,2,2,2,2,2,2,2,2,2,2,No,1
6,2,1,3,No,65+,1,No,4,4,No,Yes,No,2,1,No,0,VALID MISSING,2,,2,,,,,,2,,,,,,,,,,2,,,2,2,2,1,2,2,2,2,2,2,2,,,1,2,2,2,2,2,,2,2,2,No,1
5,,3,2,No,45-64,2,No,4,4,No,Yes,No,2,1,No,0,VALID MISSING,2,,2,1,,,,,2,,,,,,,,,,1,2,1,1,2,1,2,1,1,1,1,1,2,2,,,2,2,1,2,,,2,2,1,1,Yes,1
7,2,2,1,No,45-64,1,Yes,1,1,No,Yes,No,2,1,No,4,VALID MISSING,2,,2,1,,,,,2,,,,,,,,,,1,1,1,2,2,2,2,1,2,2,2,2,2,2,,,1,,,2,2,2,2,2,2,2,No,1
7,1,1,4,No,45-64,1,Yes,1,1,No,Yes,No,2,1,No,0,VALID MISSING,2,,2,1,,,,,2,,,,,,,,,,2,,,2,2,2,2,2,2,2,2,2,2,2,,,2,1,2,2,2,2,2,2,2,2,No,2
5,1,3,2,Yes,45-64,2,Yes,,5,No,Yes,Yes,2,1,No,5,Not in damage or destroyed building,2,,1,3,,,,,2,,,,,,,,,,1,1,1,2,1,2,2,1,1,1,1,1,1,1,1,1,1,2,2,2,2,2,2,1,2,1,Yes,1
4,1,1,1,No,65+,1,Yes,1,1,No,Yes,No,2,1,No,0,VALID MISSING,2,,1,1,,,,,2,,,,,,,,,,2,,,2,2,2,1,2,2,2,2,2,2,2,,,2,2,2,2,2,2,2,2,2,2,No,2
6,1,1,,No,25-44,2,Yes,1,1,No,Yes,No,2,1,No,0,VALID MISSING,1,,1,1,,,,,2,,,,,,1,,1,2,1,1,2,1,1,2,2,2,2,2,1,2,1,2,,,2,2,1,2,2,2,2,2,2,2,No,2
5,1,5,3,No,25-44,2,Yes,1,1,No,Yes,No,2,1,No,0,VALID MISSING,2,,1,1,,,,,2,,,,,,,,,,2,2,2,2,2,2,2,1,2,2,2,2,2,2,,,2,2,2,2,2,2,2,2,2,2,No,1
7,1,1,,No,45-64,1,Yes,1,1,No,Yes,No,2,1,No,0,VALID MISSING,1,,1,,,,,,2,,,,,,1,,1,1,1,1,2,2,2,2,1,2,2,2,2,2,2,2,,,1,2,2,2,2,2,1,1,2,2,No,2
7,2,1,3,No,65+,1,No,4,2,No,Yes,No,2,1,No,0,VALID MISSING,2,,2,1,,,,,2,,,,,,,,,,,,,2,2,2,2,2,2,2,2,2,2,1,2,1,1,2,1,2,2,2,2,2,1,2,No,2
5,1,3,3,No,45-64,1,Yes,4,1,No,Yes,No,2,1,Yes,0,VALID MISSING,2,,2,1,,,,,2,,,,,,,,,,1,1,1,2,2,2,2,1,1,2,1,2,2,2,,,1,1,1,2,2,2,2,2,2,2,No,2
6,1,3,4,No,25-44,2,Yes,5,1,No,Yes,No,2,1,No,0,VALID MISSING,2,,2,1,,,,,2,,,,,,,,,,2,,,2,2,1,2,2,2,1,2,2,2,2,,,2,2,2,2,2,2,2,2,2,2,No,1
6,1,1,3,No,45-64,1,Yes,1,1,No,Yes,No,2,1,No,0,VALID MISSING,2,1,2,1,,,,,2,,,,,4,4,,2,,1,1,1,2,1,2,2,1,1,2,2,1,2,2,,,2,1,1,2,1,2,2,2,1,1,Yes,2
5,2,3,1,No,45-64,2,Yes,4,4,No,Yes,No,2,1,No,0,VALID MISSING,2,,2,1,,,,,2,,,,,,,,,,2,,,2,2,2,2,2,1,2,2,1,2,2,,,2,2,2,2,2,2,2,2,2,2,No,1
7,1,1,4,No,45-64,1,,1,1,No,Yes,No,2,1,No,0,VALID MISSING,2,,2,1,,,,,2,,,,,,,,,,2,,,2,2,2,2,2,2,1,2,2,2,2,,,2,2,2,2,2,2,2,2,2,2,No,2
6,1,1,,No,45-64,1,No,1,1,No,Yes,No,2,1,No,0,VALID MISSING,2,,2,1,,,,,2,,,,,,,,,,,,,2,2,2,1,2,1,2,1,1,1,2,,,2,2,2,2,2,2,2,2,2,2,Yes,2
7,1,1,4,No,25-44,2,Yes,4,2,No,Yes,No,2,1,No,0,VALID MISSING,2,,1,1,,,,,2,,,,,,,,,,2,,,2,2,2,2,2,2,2,2,2,2,2,,,2,1,2,2,2,2,2,2,2,2,No,2
7,1,5,3,Yes,45-64,2,No,1,1,No,Yes,No,2,1,No,0,VALID MISSING,2,,2,1,,,,,2,,,,,,,,,,,,,2,1,2,2,2,2,2,2,2,2,2,,,1,2,2,2,2,2,2,2,2,2,No,2
6,1,1,,No,45-64,1,,,,No,Yes,No,2,1,No,0,VALID MISSING,2,,2,1,,,,,2,,,,,,,,,,2,,,2,2,2,2,2,2,2,2,2,2,2,,,2,2,2,2,2,2,2,2,2,2,No,2
6,2,5,2,Yes,25-44,1,No,5,5,No,Yes,Yes,2,1,No,1,Not in damage or destroyed building,2,,1,1,,,,,2,,,,,,,,,,2,,,1,2,2,2,2,2,1,1,2,1,2,2,2,1,2,2,2,2,2,2,2,2,1,Yes,1
5,1,1,4,No,45-64,1,Yes,1,1,No,Yes,Yes,2,1,No,3,VALID MISSING,2,,2,3,,,,,2,,,,,,,,,,1,1,1,2,2,2,2,2,2,1,2,2,2,2,,,1,1,2,2,2,2,2,2,2,2,No,1
6,1,1,1,No,45-64,2,Yes,4,4,No,Yes,No,2,1,No,0,VALID MISSING,2,,1,1,,,,,2,,,,,,,,,,,,,2,2,2,2,2,2,2,2,2,2,2,,,2,2,2,2,2,2,2,2,2,2,Yes,2
7,1,2,4,No,45-64,1,Yes,1,1,No,Yes,No,2,1,No,0,VALID MISSING,2,,1,1,,,,,2,,,,,,,,,,2,,,1,2,2,2,2,2,2,2,2,2,1,2,2,1,2,2,2,2,2,1,2,2,2,No,2
5,1,1,4,No,45-64,1,Yes,1,1,No,Yes,No,2,1,No,0,VALID MISSING,2,,1,1,,,,,2,,,,,,,,,,2,,,2,2,2,2,2,2,2,2,2,2,2,,,2,2,2,2,2,2,2,2,2,2,No,2
5,1,1,4,No,25-44,2,No,2,1,No,Yes,No,2,1,No,0,VALID MISSING,2,,1,1,,,,,2,,,,,,,,,,2,,,1,1,2,1,2,1,2,2,2,2,2,,,2,2,1,2,2,2,2,2,2,1,Yes,2
5,1,1,2,No,45-64,1,Yes,1,1,No,Yes,No,2,1,No,0,VALID MISSING,1,,2,1,,,,,2,,,,,,1,,1,1,2,,,2,2,2,2,2,2,1,2,1,2,2,,,2,2,2,2,2,2,2,1,2,2,No,1
4,1,1,,No,45-64,1,Yes,2,2,No,Yes,No,2,1,No,0,VALID MISSING,2,,3,1,,,,,2,,,,,,,,,,2,2,2,2,2,2,2,2,2,2,2,2,2,2,,,2,2,2,2,2,2,2,2,2,2,No,2
6,1,1,4,Yes,25-44,2,Yes,1,1,No,Yes,No,2,1,No,1,VALID MISSING,2,,1,2,,,,,2,,,,,,,,,,2,,,2,2,2,2,2,2,2,2,2,2,2,,,2,2,2,2,2,2,2,2,2,2,No,1
7,1,1,5,No,45-64,1,Yes,1,1,No,Yes,No,2,1,No,0,VALID MISSING,2,,2,1,,,,,2,,,,,,,,,,2,,,1,2,2,2,2,1,2,2,2,2,2,,,1,2,1,2,2,2,1,2,2,2,No,1
5,1,1,4,No,45-64,2,Yes,5,5,No,Yes,No,2,1,No,0,VALID MISSING,1,3,2,1,,,,,2,,,,,,4,,2,,2,,,2,2,1,2,2,2,1,2,2,2,2,,,2,2,1,2,2,2,2,2,2,2,No,2
6,1,1,5,No,45-64,1,Yes,1,1,No,Yes,No,2,1,No,0,VALID MISSING,2,,2,1,,,,,2,,,,,,,,,,2,,,2,2,2,2,2,2,2,2,2,2,2,,,1,2,2,2,2,2,2,1,2,2,No,2
5,2,1,3,No,65+,1,Yes,1,1,No,Yes,No,2,1,No,0,VALID MISSING,2,,2,1,,,,,2,,,,,,,,,,2,2,2,2,2,2,2,2,2,2,2,2,2,2,,,1,2,2,2,2,2,2,1,2,2,No,1
6,1,1,4,No,45-64,1,Yes,1,1,No,Yes,No,2,1,No,0,VALID MISSING,2,,2,1,,,,,2,,,,,,,,,,2,,,2,2,2,2,2,2,2,2,2,2,2,,,2,2,2,2,2,2,2,1,2,2,No,2
6,1,2,4,No,45-64,1,Yes,1,4,No,Yes,No,2,1,No,0,VALID MISSING,2,,1,1,,,,,2,,,,,,2,,1,,2,,,2,2,2,2,2,2,2,2,2,2,2,,,1,2,2,2,2,2,2,2,2,2,No,2
7,1,1,3,No,45-64,1,Yes,1,1,No,Yes,No,2,1,No,0,VALID MISSING,2,1,2,1,,,,,2,,,,,,2,2,1,,2,,,2,2,2,2,1,2,1,2,2,2,2,,,1,2,2,2,2,2,2,2,2,2,No,1
4,2,1,4,No,45-64,2,Yes,1,3,No,Yes,Yes,2,1,No,0,VALID MISSING,,,1,1,,,,,2,,,,,,,,2,3,1,1,1,1,2,2,2,2,2,2,2,2,2,2,,,2,2,1,2,2,2,2,2,2,2,No,2
5,1,1,5,No,45-64,1,Yes,1,1,No,Yes,No,2,1,No,0,VALID MISSING,2,,3,1,,,,,2,,,,,,,,,,2,,,2,2,2,1,1,2,1,2,2,2,2,,,2,2,2,2,2,2,2,2,2,2,No,1
6,1,1,4,No,45-64,1,Yes,1,1,No,Yes,No,2,1,No,0,VALID MISSING,1,,2,1,,,,,2,,,,,1,,,1,2,,,,1,2,1,1,2,2,2,2,2,2,2,,,1,2,2,2,2,2,2,2,2,2,No,1
6,1,1,3,No,45-64,1,Yes,1,2,No,Yes,No,2,1,No,0,VALID MISSING,2,,2,1,,,,,2,,,,,,,,,,2,,,1,1,2,1,2,2,1,2,2,2,2,,,2,2,2,2,2,2,2,1,2,2,Yes,1
4,1,1,4,No,25-44,1,Yes,1,1,No,Yes,No,2,1,No,0,VALID MISSING,2,,2,1,,,,,2,,,,,,,,,,2,,,2,1,2,2,2,2,2,2,2,2,2,,,2,2,2,2,2,2,2,2,2,2,No,2
5,1,1,2,No,45-64,1,Yes,,5,No,Yes,No,2,1,Yes,0,VALID MISSING,2,,2,1,,,,,2,,,,,,,,,,1,1,1,2,2,2,2,2,2,2,2,2,2,2,,,2,2,2,2,2,2,1,2,2,2,No,1
5,1,1,4,No,45-64,1,Yes,1,1,No,Yes,No,2,1,No,0,VALID MISSING,2,,1,1,,,,,2,,,,,,,,,,2,,,2,2,2,1,2,2,2,2,2,2,2,,,1,2,2,2,2,2,2,2,2,2,No,2
6,1,3,4,Yes,65+,1,Yes,4,4,No,Yes,No,2,1,No,0,VALID MISSING,2,,2,1,,,,,2,,,,,,,,,,1,1,1,1,2,1,1,1,1,1,1,1,1,2,,,1,2,2,2,2,2,2,2,2,2,Yes,1
4,1,3,2,No,45-64,2,Yes,1,1,No,Yes,No,2,1,No,0,VALID MISSING,2,,2,1,,,,,2,,,,,,,,,,2,,,2,2,2,2,1,1,2,1,1,1,2,,,2,2,2,2,2,2,2,2,2,2,Yes,1
5,1,1,,No,45-64,2,Yes,1,1,No,Yes,No,2,1,No,0,VALID MISSING,2,,3,1,,,,,2,,,,,,,,,,2,,,2,2,2,2,2,2,2,2,2,2,2,,,2,2,2,2,2,2,2,2,2,2,No,2
7,1,1,3,No,45-64,1,Yes,1,4,No,Yes,Yes,2,1,No,1,Partial collapse,2,,1,1,,,,,2,,,,,,,,,,2,,,2,2,2,2,2,2,2,2,2,2,2,,,2,2,2,2,2,2,2,2,2,2,No,2
6,1,1,4,No,25-44,1,Yes,1,1,No,Yes,No,2,1,No,4,VALID MISSING,1,,2,2,,,,,2,,,,,4,4,,1,2,2,,,,2,2,2,1,2,2,2,2,2,2,,,2,2,2,2,2,2,2,2,2,2,Yes,2
4,1,1,3,No,25-44,1,Yes,5,5,No,Yes,No,2,1,No,0,VALID MISSING,2,1,3,1,,,,,2,,,,,,2,2,1,,2,,,2,2,2,2,1,1,2,2,2,2,2,,,2,2,2,2,2,2,2,2,2,2,No,2
6,2,1,3,No,65+,1,No,1,1,No,Yes,No,2,1,No,0,VALID MISSING,2,,1,1,,,,,2,,,,,,,,,,2,,,1,1,1,2,1,1,2,1,2,1,2,,,1,2,1,2,2,2,2,1,2,1,Yes,1
5,1,1,4,No,45-64,1,Yes,1,1,No,Yes,Yes,2,1,No,0,VALID MISSING,2,,2,1,,,,,2,,,,,,1,,2,2,1,1,1,2,2,2,1,2,2,2,1,1,1,2,,,2,2,2,2,2,2,2,2,2,2,No,1
6,1,1,4,No,25-44,1,Yes,1,1,No,Yes,No,2,1,No,0,VALID MISSING,2,,2,1,,,,,2,,,,,,,,,,2,,,1,1,1,2,1,2,2,1,2,2,2,,,2,2,2,2,2,2,2,2,2,1,Yes,1
7,1,1,4,No,25-44,2,Yes,1,1,No,Yes,No,2,1,Yes,0,VALID MISSING,,1,2,1,,,,,2,,,,,4,4,4,2,,1,1,2,2,2,2,2,2,2,2,2,2,2,1,1,1,2,2,2,2,2,2,2,2,2,2,No,1
6,1,1,3,No,25-44,1,Yes,1,1,No,Yes,No,2,1,No,0,VALID MISSING,2,,1,1,,,,,2,,,,,,,,,,2,,,1,1,2,2,1,2,2,1,2,1,2,,,2,2,2,2,2,2,2,2,2,1,No,1
6,1,1,4,No,25-44,1,Yes,4,4,No,Yes,No,2,1,No,0,VALID MISSING,1,1,3,1,,,,,2,,,,,4,4,1,1,1,1,2,2,2,2,2,2,1,2,2,2,2,2,2,,,1,2,2,2,2,2,2,2,2,2,No,2
6,1,2,4,No,45-64,1,Yes,4,4,No,Yes,No,2,1,No,0,VALID MISSING,2,,3,1,,,,,2,,,,,,,,,,1,1,1,2,2,2,2,2,1,2,1,2,2,2,,,1,2,2,2,2,2,1,2,2,2,No,1
6,1,3,2,No,65+,1,No,1,1,No,Yes,No,2,1,No,0,VALID MISSING,2,,2,,,,,,2,,,,,,,,,,1,1,1,1,2,1,1,1,1,2,1,2,1,1,1,1,1,2,2,2,2,2,1,2,2,2,Yes,1
5,1,1,2,No,65+,1,No,1,1,No,Yes,No,2,1,No,0,VALID MISSING,2,,2,1,,,,,2,,,,,,,,,,2,,,2,2,2,2,2,2,2,2,2,2,2,,,1,2,2,2,2,2,1,2,2,2,No,2
7,1,1,,No,45-64,1,Yes,1,1,No,Yes,No,2,1,No,0,VALID MISSING,1,3,1,1,,,,,2,,,,,,2,,1,2,2,,,2,2,2,2,1,1,2,2,1,2,2,,,2,2,2,2,2,2,2,2,2,2,No,2
7,1,1,2,Yes,65+,2,Yes,5,5,No,Yes,No,2,1,No,2,VALID MISSING,1,,1,1,,,,,2,,,,,4,2,4,2,3,2,,,1,2,2,2,1,2,2,2,2,2,2,,,1,2,1,2,2,2,2,1,2,2,No,1
6,1,1,4,No,25-44,1,Yes,2,2,No,Yes,No,2,1,No,0,VALID MISSING,2,,1,1,,,,,2,,,,,,,,,,2,,,2,2,1,1,2,2,2,1,2,2,1,2,2,2,2,2,2,2,2,2,2,2,2,No,1
7,1,1,5,No,45-64,1,Yes,1,1,No,Yes,No,2,1,No,0,VALID MISSING,1,1,1,1,,,,,2,,,,,4,2,2,1,,2,,,2,2,1,1,2,1,2,2,2,2,2,,,2,2,2,2,2,2,2,2,2,2,No,2
6,1,3,,No,45-64,1,Yes,1,1,No,Yes,No,2,1,No,0,VALID MISSING,2,,1,1,,,,,2,,,,,,,,,,1,1,1,1,2,2,2,2,1,2,1,1,1,1,2,2,8,2,2,2,8,2,2,2,2,2,No,1
7,1,1,2,No,45-64,2,Yes,1,1,No,Yes,No,2,1,No,0,VALID MISSING,2,,1,1,,,,,2,,,,,,,,,,2,,,2,2,2,2,2,2,2,2,2,2,2,,,2,2,2,2,2,2,2,2,2,2,No,2
6,1,1,4,No,45-64,1,Yes,2,4,No,Yes,No,2,1,No,0,VALID MISSING,2,,2,1,,,,,2,,,,,,,,,,2,,,,2,2,2,2,2,2,1,2,2,2,,,2,2,2,2,2,2,2,1,2,2,No,1
5,1,1,3,No,25-44,1,Yes,1,1,No,Yes,No,2,1,No,0,VALID MISSING,2,,2,1,,,,,2,,,,,,,,,,,,,2,2,2,2,1,2,2,2,2,2,2,,,2,2,2,2,2,2,2,2,2,2,No,2
5,1,1,4,No,45-64,1,Yes,1,1,No,Yes,No,2,1,No,0,VALID MISSING,2,,2,1,,,,,2,,,,,,,,,,2,,,2,2,2,2,1,2,1,1,2,2,2,,,2,2,2,2,2,2,2,2,2,2,No,1
5,1,1,4,No,45-64,1,Yes,1,1,No,Yes,No,2,1,No,0,VALID MISSING,2,,1,1,,,,,2,,,,,,,,,,2,,,2,2,2,2,2,2,2,2,2,2,2,2,2,1,2,2,2,2,2,1,2,2,2,No,1
6,1,1,4,No,45-64,1,Yes,1,1,No,Yes,No,2,1,No,0,VALID MISSING,2,,1,1,,,,,2,,,,,,,,,,2,,,2,1,2,2,2,2,1,2,2,2,2,,,1,2,1,2,2,2,2,2,2,2,No,1
7,1,2,1,No,45-64,2,Yes,5,5,No,Yes,No,2,1,No,0,VALID MISSING,2,,3,1,,,,,2,,,,,,,,,,2,,,2,2,2,2,2,2,2,2,2,2,2,,,2,2,2,2,2,2,2,2,2,2,No,2
5,1,1,4,No,45-64,1,Yes,2,2,No,Yes,No,2,1,No,0,VALID MISSING,2,,2,1,,,,,2,,,,,,,,,,2,,,2,2,2,2,2,2,2,2,2,2,2,,,1,2,2,2,2,2,2,2,2,2,No,2
6,1,1,2,No,45-64,1,Yes,4,4,No,Yes,No,2,1,No,0,VALID MISSING,2,,3,1,,,,,2,,,,,,,,,,1,1,1,1,1,1,2,2,1,2,2,1,2,2,,,1,2,2,2,2,2,2,2,2,2,No,1
6,1,2,4,No,25-44,2,Yes,1,1,No,Yes,Yes,2,1,No,5,Not in damage or destroyed building,2,,1,2,,,,,2,,,,,,,,,,1,2,1,2,2,2,2,2,2,2,2,2,2,2,,,2,2,2,2,2,2,2,2,2,2,Yes,2
7,1,5,,No,45-64,1,Yes,1,1,No,Yes,No,2,1,No,0,VALID MISSING,2,,2,1,,,,,2,,,,,,,,,,1,1,1,1,2,2,2,2,1,2,1,1,1,1,1,1,2,2,2,2,1,2,2,2,,2,No,1
6,1,1,4,No,45-64,2,Yes,1,1,No,Yes,No,2,1,No,0,VALID MISSING,2,,2,1,,,,,2,,,,,,,,,,2,,,2,2,2,2,1,2,1,2,2,2,2,,,2,2,2,2,2,2,2,2,2,2,No,2
6,1,2,,No,45-64,1,Yes,1,1,No,Yes,No,2,1,No,0,VALID MISSING,2,,1,1,,,,,2,,,,,,,,,,,,,2,2,1,2,1,1,2,2,1,2,2,,,2,2,2,2,2,2,2,2,2,2,No,1
5,1,1,3,No,65+,1,Yes,1,1,No,Yes,No,2,1,No,0,VALID MISSING,2,1,1,1,,,,,2,,,,,,4,4,1,2,2,,,2,2,2,2,2,2,2,2,2,2,2,,,1,2,2,2,2,2,2,1,2,2,No,1
5,1,3,4,No,18-24,1,Yes,5,5,No,Yes,No,2,1,No,0,VALID MISSING,2,,1,1,,,,,2,,,,,,,,,,1,2,1,2,2,1,2,2,1,1,2,2,2,1,1,1,2,2,2,2,2,2,2,2,2,2,No,1
4,2,1,2,No,65+,2,No,3,3,No,Yes,No,2,1,No,0,VALID MISSING,2,,1,1,,,,,2,,,,,,,,,,,,,2,2,,,,,,,,,2,,,2,2,2,2,2,2,2,2,2,2,No,
6,1,1,2,No,45-64,2,Yes,4,4,No,Yes,No,2,1,No,0,VALID MISSING,2,,2,1,,,,,2,,,,,,,,,,,,,2,2,2,2,2,2,2,2,2,2,2,,,1,2,2,2,2,2,2,2,2,2,No,2
7,1,1,4,No,45-64,1,Yes,1,1,No,Yes,No,2,1,No,0,VALID MISSING,2,1,1,1,,,,,2,,,,,,,,,,1,2,1,2,2,2,2,2,1,2,2,1,2,1,1,1,2,2,1,2,2,2,2,2,2,2,No,2
5,2,1,,No,65+,2,Yes,1,1,No,Yes,No,2,1,No,0,VALID MISSING,2,,1,1,,,,,2,,,,,,,,,,1,1,1,2,2,2,2,1,2,2,2,2,2,2,,,2,2,1,2,2,2,2,1,2,2,No,1
7,1,1,4,No,45-64,1,Yes,5,5,No,No,Yes,2,1,No,2,Moderate damage,,,1,1,,,,,2,,,,,,,,,,2,,,2,2,2,2,2,2,1,2,2,2,2,,,2,2,2,2,2,2,2,2,2,2,No,2
6,2,3,1,No,25-44,2,Yes,,5,No,Yes,No,2,1,No,0,VALID MISSING,2,,2,1,,,,,2,,,,,,,,,,2,,,2,2,2,2,1,1,2,2,2,2,1,1,1,2,2,2,2,2,2,1,2,2,2,No,2
6,2,1,3,No,45-64,1,Yes,1,1,No,Yes,No,2,1,No,0,VALID MISSING,1,,2,1,,,,,2,,,,,1,1,1,1,1,,,,2,2,2,2,2,2,2,2,2,2,2,,,2,2,2,2,2,2,2,2,2,2,No,2
5,1,1,4,No,45-64,1,Yes,1,1,No,Yes,No,2,1,Yes,0,VALID MISSING,1,,1,1,,,,,2,,,,,,2,,1,3,2,1,2,1,2,2,2,1,2,1,1,2,1,2,,,1,2,2,2,2,2,2,2,2,2,No,1
6,2,1,,No,65+,1,Yes,1,1,No,Yes,No,2,1,No,0,VALID MISSING,2,,1,1,,,,,2,,,,,,,,,,1,1,1,2,2,2,1,1,1,2,1,1,2,2,,,2,2,2,2,2,2,2,1,2,2,No,1
7,1,1,3,No,45-64,1,Yes,1,1,No,Yes,No,2,1,No,0,VALID MISSING,2,1,2,1,,,,,2,,,,,2,1,4,1,1,2,,,2,2,2,1,2,1,2,2,2,2,2,,,1,2,1,2,2,2,2,2,2,2,No,2
6,1,5,4,No,45-64,1,Yes,1,1,No,Yes,No,2,1,No,0,VALID MISSING,1,,2,1,,,,,2,,,,,,1,,1,2,2,,,2,2,2,2,2,2,1,2,2,2,2,,,1,2,2,2,2,2,1,2,2,2,No,1
5,1,1,4,No,45-64,1,Yes,1,1,No,Yes,No,2,1,No,0,VALID MISSING,1,,,1,,,,,2,,,,,4,2,,1,2,2,,,2,2,1,2,2,1,1,2,1,2,2,,,1,2,2,2,2,2,2,2,2,2,Yes,2
7,2,1,,No,45-64,1,No,1,1,No,Yes,No,2,1,No,0,VALID MISSING,2,1,3,1,,,,,2,,,,,4,2,4,2,2,1,1,1,2,2,2,1,1,2,2,2,2,2,2,,,2,2,2,2,2,2,2,2,2,2,No,1
5,1,1,,No,45-64,2,No,5,5,No,Yes,No,2,1,No,0,VALID MISSING,2,,2,1,,,,,2,,,,,,,,,,2,,,,,1,2,2,2,1,2,2,1,1,2,1,2,2,2,2,2,2,2,2,2,,No,2
5,1,1,4,No,45-64,1,Yes,1,1,No,Yes,No,2,1,No,4,VALID MISSING,1,,3,1,,,,,2,,,,,4,4,4,1,,1,1,1,2,2,2,1,1,2,2,2,2,2,2,,,1,2,2,2,2,2,2,2,2,2,No,2
7,2,1,3,No,45-64,1,Yes,1,1,No,Yes,No,2,1,No,0,VALID MISSING,2,,2,1,,,,,2,,,,,,,,,,2,,,2,2,2,2,2,2,2,2,2,2,2,,,1,1,1,2,2,2,2,1,2,2,No,2
7,2,1,4,No,45-64,1,Yes,1,1,No,Yes,No,2,1,No,0,VALID MISSING,2,,2,1,,,,,2,,,,,,,,,,1,1,1,2,2,2,2,2,2,2,2,2,2,2,,,2,2,2,2,2,2,2,1,2,2,No,2
4,1,1,3,No,45-64,1,Yes,1,1,No,Yes,No,2,1,No,0,VALID MISSING,1,,1,1,,,,,2,,,,,4,4,4,2,3,2,,,2,2,2,1,2,1,2,2,2,2,2,,,2,2,2,2,2,2,2,2,2,2,No,2
7,1,1,5,No,45-64,1,Yes,1,1,No,Yes,No,2,1,No,0,VALID MISSING,2,,1,1,,,,,2,,,,,,,,,,2,,,2,2,2,2,2,2,1,2,2,2,2,,,1,2,2,2,2,2,2,2,2,2,No,2
7,,5,,No,65+,1,No,2,2,No,Yes,No,2,1,No,0,VALID MISSING,2,,2,1,,,,,2,,,,,,,,,,2,,,1,2,2,2,1,2,1,2,2,2,2,,,,,,,2,2,,1,2,2,No,2
5,1,1,2,No,25-44,1,Yes,1,1,No,Yes,No,2,1,No,0,VALID MISSING,2,,2,1,,,,,2,,,,,,,,,,2,,,2,2,2,2,1,2,2,2,2,2,2,,,1,2,2,2,2,2,2,2,2,2,No,2
6,1,2,,No,65+,2,No,1,1,No,Yes,No,2,1,Yes,0,VALID MISSING,,2,1,1,,,,,2,,,,,2,2,,2,2,1,1,2,2,2,2,2,1,2,2,2,2,2,2,2,2,1,2,2,2,2,2,1,2,2,2,No,2
6,1,1,2,No,25-44,1,Yes,5,2,No,Yes,No,2,1,Yes,0,VALID MISSING,1,1,1,1,,,,,2,,,,,,1,,1,2,2,,,2,2,2,2,1,2,2,2,2,2,2,,,1,2,2,2,2,2,2,2,2,2,No,2
6,1,1,1,No,45-64,2,Yes,1,4,No,Yes,No,2,1,No,0,VALID MISSING,2,,3,1,,,,,2,,,,,,,,,,,,,2,2,2,2,2,2,2,2,2,2,2,,,2,2,2,2,2,2,2,2,2,2,No,2